BDBM50243302 CHEMBL454086::Tetrahydrofuran-2-ylmethyl[4-({[2-(pyridin-2-ylcarbonyl)phenyl}-amino}sulfonyl)phenyl]carbamate
SMILES: O=C(Nc1ccc(cc1)S(=O)(=O)Nc1ccccc1C(=O)c1ccccn1)OCC1CCCO1
InChI Key: InChIKey=PLUSCNOLGPTWEQ-UHFFFAOYSA-N
Data: 2 KI  2 IC50
Activity Spreadsheet -- Enzyme Inhibition Constant Data from BindingDB
Found 4 hits for monomerid = 50243302
Trg + Lig
Ki
nM
ΔG°
kcal/mole
IC50
nM
Kd
nM
EC50/IC50
nM
koff
s-1
kon
M-1s-1
pHTemp
°C
Bradykinin B1 receptor
(Homo sapiens (Human))
BDBM50243302
(CHEMBL454086 | Tetrahydrofuran-2-ylmethyl[4-({[2-(...)
Show SMILES O=C(Nc1ccc(cc1)S(=O)(=O)Nc1ccccc1C(=O)c1ccccn1)OCC1CCCO1
Show InChI InChI=1S/C24H23N3O6S/c28-23(22-9-3-4-14-25-22)20-7-1-2-8-21(20)27-34(30,31)19-12-10-17(11-13-19)26-24(29)33-16-18-6-5-15-32-18/h1-4,7-14,18,27H,5-6,15-16H2,(H,26,29)
2.60n/an/an/an/an/an/an/an/a
Merck Research Laboratories
Curated by ChEMBL
Assay Description
Binding affinity to human bradykinin B1 receptor
J Med Chem 51: 3946-52 (2008)
Article DOI: 10.1021/jm800199h
BindingDB Entry DOI: 10.7270/Q2JH3N33
Bradykinin B1 receptor
(Homo sapiens (Human))
BDBM50243302
(CHEMBL454086 | Tetrahydrofuran-2-ylmethyl[4-({[2-(...)
Show SMILES O=C(Nc1ccc(cc1)S(=O)(=O)Nc1ccccc1C(=O)c1ccccn1)OCC1CCCO1
Show InChI InChI=1S/C24H23N3O6S/c28-23(22-9-3-4-14-25-22)20-7-1-2-8-21(20)27-34(30,31)19-12-10-17(11-13-19)26-24(29)33-16-18-6-5-15-32-18/h1-4,7-14,18,27H,5-6,15-16H2,(H,26,29)
2.60n/an/an/an/an/an/an/an/a
Merck Research Laboratories
Curated by ChEMBL
Assay Description
Binding affinity to human bradykinin B1 receptor
J Med Chem 51: 3946-52 (2008)
Article DOI: 10.1021/jm800199h
BindingDB Entry DOI: 10.7270/Q2JH3N33
Potassium voltage-gated channel subfamily H member 2
(Homo sapiens (Human))
BDBM50243302
(CHEMBL454086 | Tetrahydrofuran-2-ylmethyl[4-({[2-(...)
Show SMILES O=C(Nc1ccc(cc1)S(=O)(=O)Nc1ccccc1C(=O)c1ccccn1)OCC1CCCO1
Show InChI InChI=1S/C24H23N3O6S/c28-23(22-9-3-4-14-25-22)20-7-1-2-8-21(20)27-34(30,31)19-12-10-17(11-13-19)26-24(29)33-16-18-6-5-15-32-18/h1-4,7-14,18,27H,5-6,15-16H2,(H,26,29)
Reactome pathway
n/an/a>1.00E+4n/an/an/an/an/an/a
Merck Research Laboratories
Curated by ChEMBL
Assay Description
Displacement of MK-499 from human ERG channel in HEK293 cells
J Med Chem 51: 3946-52 (2008)
Article DOI: 10.1021/jm800199h
BindingDB Entry DOI: 10.7270/Q2JH3N33
Potassium voltage-gated channel subfamily H member 2
(Homo sapiens (Human))
BDBM50243302
(CHEMBL454086 | Tetrahydrofuran-2-ylmethyl[4-({[2-(...)
Show SMILES O=C(Nc1ccc(cc1)S(=O)(=O)Nc1ccccc1C(=O)c1ccccn1)OCC1CCCO1
Show InChI InChI=1S/C24H23N3O6S/c28-23(22-9-3-4-14-25-22)20-7-1-2-8-21(20)27-34(30,31)19-12-10-17(11-13-19)26-24(29)33-16-18-6-5-15-32-18/h1-4,7-14,18,27H,5-6,15-16H2,(H,26,29)
Reactome pathway
n/an/a>1.00E+4n/an/an/an/an/an/a
Merck Research Laboratories
Curated by ChEMBL
Assay Description
Displacement of MK-499 from human ERG channel in HEK293 cells
J Med Chem 51: 3946-52 (2008)
Article DOI: 10.1021/jm800199h
BindingDB Entry DOI: 10.7270/Q2JH3N33