BDBM50243472 1-(5-(4-(2-(diethylamino)ethoxy)phenyl)-3-(pyridin-3-ylcarbamoyl)thiophen-2-yl)urea::CHEMBL460888
SMILES: CCN(CC)CCOc1ccc(cc1)-c1cc(C(=O)Nc2cccnc2)c(NC(N)=O)s1
InChI Key: InChIKey=BKJYSELXLJGLNW-UHFFFAOYSA-N
Data: 2 IC50
Activity Spreadsheet -- Enzyme Inhibition Constant Data from BindingDB
Found 2 hits for monomerid = 50243472
Trg + Lig
Ki
nM
ΔG°
kcal/mole
IC50
nM
Kd
nM
EC50/IC50
nM
koff
s-1
kon
M-1s-1
pHTemp
°C
Cyclin-dependent kinase 2-associated protein 1
(Homo sapiens (Human))
BDBM50243472
(1-(5-(4-(2-(diethylamino)ethoxy)phenyl)-3-(pyridin...)
Show SMILES CCN(CC)CCOc1ccc(cc1)-c1cc(C(=O)Nc2cccnc2)c(NC(N)=O)s1
Show InChI InChI=1S/C23H27N5O3S/c1-3-28(4-2)12-13-31-18-9-7-16(8-10-18)20-14-19(22(32-20)27-23(24)30)21(29)26-17-6-5-11-25-15-17/h5-11,14-15H,3-4,12-13H2,1-2H3,(H,26,29)(H3,24,27,30)
n/an/a 4.40E+4n/an/an/an/an/an/a
AstraZeneca R&D Boston
Curated by ChEMBL
Assay Description
Inhibition of Cdk1
Bioorg Med Chem Lett 18: 4242-8 (2008)
Article DOI: 10.1016/j.bmcl.2008.05.016
BindingDB Entry DOI: 10.7270/Q2J102Z9
Serine/threonine-protein kinase Chk1
(Homo sapiens (Human))
BDBM50243472
(1-(5-(4-(2-(diethylamino)ethoxy)phenyl)-3-(pyridin...)
Show SMILES CCN(CC)CCOc1ccc(cc1)-c1cc(C(=O)Nc2cccnc2)c(NC(N)=O)s1
Show InChI InChI=1S/C23H27N5O3S/c1-3-28(4-2)12-13-31-18-9-7-16(8-10-18)20-14-19(22(32-20)27-23(24)30)21(29)26-17-6-5-11-25-15-17/h5-11,14-15H,3-4,12-13H2,1-2H3,(H,26,29)(H3,24,27,30)
Reactome pathway
n/an/a 100n/an/an/an/an/an/a
AstraZeneca R&D Boston
Curated by ChEMBL
Assay Description
Inhibition of Chk1
Bioorg Med Chem Lett 18: 4242-8 (2008)
Article DOI: 10.1016/j.bmcl.2008.05.016
BindingDB Entry DOI: 10.7270/Q2J102Z9
3D
3D Structure (docked)