BDBM50243487 CHEMBL4091668
SMILES: O[C@@H]1CN(CC1(F)F)c1ccc(s1)S(=O)(=O)Nc1cc2c(cc[nH]c2=O)cc1F
InChI Key: InChIKey=CQYXSDSLQRMVCQ-CYBMUJFWSA-N
Data: 1 IC50  1 EC50
Activity Spreadsheet -- Enzyme Inhibition Constant Data from BindingDB
Found 2 hits for monomerid = 50243487
Trg + Lig
Ki
nM
ΔG°
kcal/mole
IC50
nM
Kd
nM
EC50/IC50
nM
koff
s-1
kon
M-1s-1
pHTemp
°C
Thymidylate synthase/GAR transformylase/AICAR transformylase
(Homo sapiens (Human))
BDBM50243487
(CHEMBL4091668)
Show SMILES O[C@@H]1CN(CC1(F)F)c1ccc(s1)S(=O)(=O)Nc1cc2c(cc[nH]c2=O)cc1F |r|
Show InChI InChI=1S/C17H14F3N3O4S2/c18-11-5-9-3-4-21-16(25)10(9)6-12(11)22-29(26,27)15-2-1-14(28-15)23-7-13(24)17(19,20)8-23/h1-6,13,22,24H,7-8H2,(H,21,25)/t13-/m1/s1
Reactome pathway
n/an/a 12n/an/an/an/an/an/a
Lilly Research Laboratories
Curated by ChEMBL
Assay Description
Inhibition of human full length N-terminal His-tagged AICARFT expressed in Escherichia coli BL21 (DE3) using ZMP/10-formyltetrahydrofolate as substra...
J Med Chem 60: 9599-9616 (2017)
Article DOI: 10.1021/acs.jmedchem.7b01046
BindingDB Entry DOI: 10.7270/Q2222X6J
Thymidylate synthase/GAR transformylase/AICAR transformylase
(Homo sapiens (Human))
BDBM50243487
(CHEMBL4091668)
Show SMILES O[C@@H]1CN(CC1(F)F)c1ccc(s1)S(=O)(=O)Nc1cc2c(cc[nH]c2=O)cc1F |r|
Show InChI InChI=1S/C17H14F3N3O4S2/c18-11-5-9-3-4-21-16(25)10(9)6-12(11)22-29(26,27)15-2-1-14(28-15)23-7-13(24)17(19,20)8-23/h1-6,13,22,24H,7-8H2,(H,21,25)/t13-/m1/s1
Reactome pathway
n/an/an/an/a 27n/an/an/an/a
Lilly Research Laboratories
Curated by ChEMBL
Assay Description
Inhibition of AICARFT in human NCI-H460 cells assessed as increase in ZMP levels using low folate media after 16 hrs by LC-MS method
J Med Chem 60: 9599-9616 (2017)
Article DOI: 10.1021/acs.jmedchem.7b01046
BindingDB Entry DOI: 10.7270/Q2222X6J