BDBM50243611 CHEMBL4085407
SMILES: Cc1c(nc(-c2ccc(Cl)cc2Cl)n1-c1ccc(OS(=O)(=O)CCC(F)(F)F)cc1)C(=O)N[C@H]1CCCC[C@H]1N
InChI Key: InChIKey=RUPJCIKDYFACJK-YADHBBJMSA-N
Data: 2 KI  2 IC50
Activity Spreadsheet -- Enzyme Inhibition Constant Data from BindingDB
Found 4 hits for monomerid = 50243611
Trg + Lig
Ki
nM
ΔG°
kcal/mole
IC50
nM
Kd
nM
EC50/IC50
nM
koff
s-1
kon
M-1s-1
pHTemp
°C
Cannabinoid receptor 1
(Homo sapiens (Human))
BDBM50243611
(CHEMBL4085407)
Show SMILES Cc1c(nc(-c2ccc(Cl)cc2Cl)n1-c1ccc(OS(=O)(=O)CCC(F)(F)F)cc1)C(=O)N[C@H]1CCCC[C@H]1N |r|
Show InChI InChI=1S/C26H27Cl2F3N4O4S/c1-15-23(25(36)33-22-5-3-2-4-21(22)32)34-24(19-11-6-16(27)14-20(19)28)35(15)17-7-9-18(10-8-17)39-40(37,38)13-12-26(29,30)31/h6-11,14,21-22H,2-5,12-13,32H2,1H3,(H,33,36)/t21-,22+/m1/s1
NCI pathway
Reactome pathway
0.316n/an/an/an/an/an/an/an/a
Leiden University
Curated by ChEMBL
Assay Description
Displacement of [3H]CP55940 from recombinant human CB1 receptor expressed in beta-galactosidase expressing CHOK1 cell membranes after 60 mins by scin...
J Med Chem 60: 9545-9564 (2017)
Article DOI: 10.1021/acs.jmedchem.7b00861
BindingDB Entry DOI: 10.7270/Q2X92DQ7
Cannabinoid receptor 1
(Homo sapiens (Human))
BDBM50243611
(CHEMBL4085407)
Show SMILES Cc1c(nc(-c2ccc(Cl)cc2Cl)n1-c1ccc(OS(=O)(=O)CCC(F)(F)F)cc1)C(=O)N[C@H]1CCCC[C@H]1N |r|
Show InChI InChI=1S/C26H27Cl2F3N4O4S/c1-15-23(25(36)33-22-5-3-2-4-21(22)32)34-24(19-11-6-16(27)14-20(19)28)35(15)17-7-9-18(10-8-17)39-40(37,38)13-12-26(29,30)31/h6-11,14,21-22H,2-5,12-13,32H2,1H3,(H,33,36)/t21-,22+/m1/s1
NCI pathway
Reactome pathway
0.520n/an/an/an/an/an/an/an/a
Leiden University
Curated by ChEMBL
Assay Description
Displacement of [3H]CP55940 from recombinant human CB1 receptor expressed in beta-galactosidase expressing CHOK1 cell membranes after 60 mins by scin...
J Med Chem 60: 9545-9564 (2017)
Article DOI: 10.1021/acs.jmedchem.7b00861
BindingDB Entry DOI: 10.7270/Q2X92DQ7
Cannabinoid receptor 1
(Homo sapiens (Human))
BDBM50243611
(CHEMBL4085407)
Show SMILES Cc1c(nc(-c2ccc(Cl)cc2Cl)n1-c1ccc(OS(=O)(=O)CCC(F)(F)F)cc1)C(=O)N[C@H]1CCCC[C@H]1N |r|
Show InChI InChI=1S/C26H27Cl2F3N4O4S/c1-15-23(25(36)33-22-5-3-2-4-21(22)32)34-24(19-11-6-16(27)14-20(19)28)35(15)17-7-9-18(10-8-17)39-40(37,38)13-12-26(29,30)31/h6-11,14,21-22H,2-5,12-13,32H2,1H3,(H,33,36)/t21-,22+/m1/s1
NCI pathway
Reactome pathway
n/an/a 7.10n/an/an/an/an/an/a
Leiden University
Curated by ChEMBL
Assay Description
Antagonist activity at recombinant human CB1 receptor expressed in HEK293 cell membranes assessed as inhibition of CP55940-induced [35S]GTPgammaS bin...
J Med Chem 60: 9545-9564 (2017)
Article DOI: 10.1021/acs.jmedchem.7b00861
BindingDB Entry DOI: 10.7270/Q2X92DQ7
Cannabinoid receptor 1
(Homo sapiens (Human))
BDBM50243611
(CHEMBL4085407)
Show SMILES Cc1c(nc(-c2ccc(Cl)cc2Cl)n1-c1ccc(OS(=O)(=O)CCC(F)(F)F)cc1)C(=O)N[C@H]1CCCC[C@H]1N |r|
Show InChI InChI=1S/C26H27Cl2F3N4O4S/c1-15-23(25(36)33-22-5-3-2-4-21(22)32)34-24(19-11-6-16(27)14-20(19)28)35(15)17-7-9-18(10-8-17)39-40(37,38)13-12-26(29,30)31/h6-11,14,21-22H,2-5,12-13,32H2,1H3,(H,33,36)/t21-,22+/m1/s1
NCI pathway
Reactome pathway
n/an/a 6.30n/an/an/an/an/an/a
Leiden University
Curated by ChEMBL
Assay Description
Antagonist activity at recombinant human CB1 receptor expressed in HEK293 cell membranes assessed as inhibition of CP55940-induced [35S]GTPgammaS bin...
J Med Chem 60: 9545-9564 (2017)
Article DOI: 10.1021/acs.jmedchem.7b00861
BindingDB Entry DOI: 10.7270/Q2X92DQ7