BDBM50243673 CHEMBL471371::N-[4-(2-Benzoyl-phenylsulfamoyl)-phenyl]-acetamide
SMILES: CC(=O)Nc1ccc(cc1)S(=O)(=O)Nc1ccccc1C(=O)c1ccccc1
InChI Key: InChIKey=UNLFTWXGUFGGQA-UHFFFAOYSA-N
Data: 2 KI  1 IC50
Activity Spreadsheet -- Enzyme Inhibition Constant Data from BindingDB
Found 3 hits for monomerid = 50243673
Trg + Lig
Ki
nM
ΔG°
kcal/mole
IC50
nM
Kd
nM
EC50/IC50
nM
koff
s-1
kon
M-1s-1
pHTemp
°C
Bradykinin B1 receptor
(Homo sapiens (Human))
BDBM50243673
(CHEMBL471371 | N-[4-(2-Benzoyl-phenylsulfamoyl)-ph...)
Show SMILES CC(=O)Nc1ccc(cc1)S(=O)(=O)Nc1ccccc1C(=O)c1ccccc1
Show InChI InChI=1S/C21H18N2O4S/c1-15(24)22-17-11-13-18(14-12-17)28(26,27)23-20-10-6-5-9-19(20)21(25)16-7-3-2-4-8-16/h2-14,23H,1H3,(H,22,24)
45n/an/an/an/an/an/an/an/a
Johnson& Johnson Pharmaceutical Research and Development
Curated by ChEMBL
Assay Description
Displacement of [3H]Lys0-des-Arg9-BK at human bradykinin B1 receptor expressed in HEK293 cells
J Med Chem 53: 5383-99 (2010)
Article DOI: 10.1021/jm1000776
BindingDB Entry DOI: 10.7270/Q289162Z
Bradykinin B1 receptor
(Homo sapiens (Human))
BDBM50243673
(CHEMBL471371 | N-[4-(2-Benzoyl-phenylsulfamoyl)-ph...)
Show SMILES CC(=O)Nc1ccc(cc1)S(=O)(=O)Nc1ccccc1C(=O)c1ccccc1
Show InChI InChI=1S/C21H18N2O4S/c1-15(24)22-17-11-13-18(14-12-17)28(26,27)23-20-10-6-5-9-19(20)21(25)16-7-3-2-4-8-16/h2-14,23H,1H3,(H,22,24)
45n/an/an/an/an/an/an/an/a
Merck Research Laboratories
Curated by ChEMBL
Assay Description
Binding affinity to human bradykinin B1 receptor
J Med Chem 51: 3946-52 (2008)
Article DOI: 10.1021/jm800199h
BindingDB Entry DOI: 10.7270/Q2JH3N33
Potassium voltage-gated channel subfamily H member 2
(Homo sapiens (Human))
BDBM50243673
(CHEMBL471371 | N-[4-(2-Benzoyl-phenylsulfamoyl)-ph...)
Show SMILES CC(=O)Nc1ccc(cc1)S(=O)(=O)Nc1ccccc1C(=O)c1ccccc1
Show InChI InChI=1S/C21H18N2O4S/c1-15(24)22-17-11-13-18(14-12-17)28(26,27)23-20-10-6-5-9-19(20)21(25)16-7-3-2-4-8-16/h2-14,23H,1H3,(H,22,24)
Reactome pathway
n/an/a>1.00E+4n/an/an/an/an/an/a
Merck Research Laboratories
Curated by ChEMBL
Assay Description
Displacement of MK-499 from human ERG channel in HEK293 cells
J Med Chem 51: 3946-52 (2008)
Article DOI: 10.1021/jm800199h
BindingDB Entry DOI: 10.7270/Q2JH3N33