null
SMILES: OC(=O)[C@H](Cc1ccc(cc1)-n1c(nc2cccnc12)C1CCCNC1)NC1=C(Br)C(=O)C11CCCCC1
InChI Key: InChIKey=ZRZRMFPBYJFMQN-BPARTEKVSA-N
Activity Spreadsheet -- Enzyme Inhibition Constant Data from BindingDB
Found 1 hit for monomerid = 50243824
Trg + Lig
Ki
nM
ΔG°
kcal/mole
IC50
nM
Kd
nM
EC50/IC50
nM
koff
s-1
kon
M-1s-1
pHTemp
°C
Integrin alpha-4
(Homo sapiens (Human))
BDBM50243824
((S)-2-(2-Bromo-3-oxo-spiro[3.5]non-1-en-1-ylamino)...)
Show SMILES OC(=O)[C@H](Cc1ccc(cc1)-n1c(nc2cccnc12)C1CCCNC1)NC1=C(Br)C(=O)C11CCCCC1 |r,c:31|
Show InChI InChI=1S/C29H32BrN5O3/c30-23-24(29(25(23)36)12-2-1-3-13-29)33-22(28(37)38)16-18-8-10-20(11-9-18)35-26(19-6-4-14-31-17-19)34-21-7-5-15-32-27(21)35/h5,7-11,15,19,22,31,33H,1-4,6,12-14,16-17H2,(H,37,38)/t19?,22-/m0/s1
n/an/a 6n/an/an/an/an/an/a
UCB
Curated by ChEMBL
Assay Description
Inhibition of integrin alpha4beta1 receptor in human whole blood by flow cytometry
Bioorg Med Chem Lett 18: 4146-9 (2008)
Article DOI: 10.1016/j.bmcl.2008.05.075
BindingDB Entry DOI: 10.7270/Q2JW8DQZ