BDBM50243891 1-phenyl-3-aza-bicyclo[3.1.0]hexane::CHEMBL503383
SMILES: C1C2CNCC12c1ccccc1
InChI Key: InChIKey=HYXPTPHIWQWOQF-UHFFFAOYSA-N
Data: 3 IC50
Activity Spreadsheet -- Enzyme Inhibition Constant Data from BindingDB
Found 3 hits for monomerid = 50243891
Trg + Lig
Ki
nM
ΔG°
kcal/mole
IC50
nM
Kd
nM
EC50/IC50
nM
koff
s-1
kon
M-1s-1
pHTemp
°C
Sodium-dependent serotonin transporter
(Rattus norvegicus (rat))
BDBM50243891
(1-phenyl-3-aza-bicyclo[3.1.0]hexane | CHEMBL503383)
Show SMILES C1C2CNCC12c1ccccc1
Show InChI InChI=1S/C11H13N/c1-2-4-9(5-3-1)11-6-10(11)7-12-8-11/h1-5,10,12H,6-8H2
n/an/a 5.20E+3n/an/an/an/an/an/a
Neurocrine Biosciences, Inc.
Curated by ChEMBL
Assay Description
Inhibition of serotonin uptake at SERT in rat brain synaptosome
Bioorg Med Chem Lett 18: 3682-6 (2008)
Article DOI: 10.1016/j.bmcl.2008.05.077
BindingDB Entry DOI: 10.7270/Q26974G5
Sodium-dependent dopamine transporter
(Rattus norvegicus (rat))
BDBM50243891
(1-phenyl-3-aza-bicyclo[3.1.0]hexane | CHEMBL503383)
Show SMILES C1C2CNCC12c1ccccc1
Show InChI InChI=1S/C11H13N/c1-2-4-9(5-3-1)11-6-10(11)7-12-8-11/h1-5,10,12H,6-8H2
Reactome pathway
n/an/a 2.70E+3n/an/an/an/an/an/a
Neurocrine Biosciences, Inc.
Curated by ChEMBL
Assay Description
Inhibition of dopamine uptake at cloned DAT in rat brain synaptosome
Bioorg Med Chem Lett 18: 3682-6 (2008)
Article DOI: 10.1016/j.bmcl.2008.05.077
BindingDB Entry DOI: 10.7270/Q26974G5
Transporter
(Rattus norvegicus (rat))
BDBM50243891
(1-phenyl-3-aza-bicyclo[3.1.0]hexane | CHEMBL503383)
Show SMILES C1C2CNCC12c1ccccc1
Show InChI InChI=1S/C11H13N/c1-2-4-9(5-3-1)11-6-10(11)7-12-8-11/h1-5,10,12H,6-8H2
Reactome pathway
n/an/a 350n/an/an/an/an/an/a
Neurocrine Biosciences, Inc.
Curated by ChEMBL
Assay Description
Inhibition of norepinephrine uptake at NET in rat brain synaptosome
Bioorg Med Chem Lett 18: 3682-6 (2008)
Article DOI: 10.1016/j.bmcl.2008.05.077
BindingDB Entry DOI: 10.7270/Q26974G5