BDBM50243894 (cis)-1,6-diphenyl-3-aza-bicyclo[3.1.0]hexane::CHEMBL488473
SMILES: C1NC[C@@]2([C@H]1[C@H]2c1ccccc1)c1ccccc1
InChI Key: InChIKey=MVCAANSQOXMPQN-ZACQAIPSSA-N
Data: 3 IC50
Activity Spreadsheet -- Enzyme Inhibition Constant Data from BindingDB
Found 3 hits for monomerid = 50243894
Trg + Lig
Ki
nM
ΔG°
kcal/mole
IC50
nM
Kd
nM
EC50/IC50
nM
koff
s-1
kon
M-1s-1
pHTemp
°C
Transporter
(Rattus norvegicus (rat))
BDBM50243894
((cis)-1,6-diphenyl-3-aza-bicyclo[3.1.0]hexane | CH...)
Show SMILES C1NC[C@@]2([C@H]1[C@H]2c1ccccc1)c1ccccc1 |r|
Show InChI InChI=1S/C17H17N/c1-3-7-13(8-4-1)16-15-11-18-12-17(15,16)14-9-5-2-6-10-14/h1-10,15-16,18H,11-12H2/t15-,16-,17+/m1/s1
Reactome pathway
n/an/a 120n/an/an/an/an/an/a
Neurocrine Biosciences, Inc.
Curated by ChEMBL
Assay Description
Inhibition of norepinephrine uptake at NET in rat brain synaptosome
Bioorg Med Chem Lett 18: 3682-6 (2008)
Article DOI: 10.1016/j.bmcl.2008.05.077
BindingDB Entry DOI: 10.7270/Q26974G5
Sodium-dependent dopamine transporter
(Rattus norvegicus (rat))
BDBM50243894
((cis)-1,6-diphenyl-3-aza-bicyclo[3.1.0]hexane | CH...)
Show SMILES C1NC[C@@]2([C@H]1[C@H]2c1ccccc1)c1ccccc1 |r|
Show InChI InChI=1S/C17H17N/c1-3-7-13(8-4-1)16-15-11-18-12-17(15,16)14-9-5-2-6-10-14/h1-10,15-16,18H,11-12H2/t15-,16-,17+/m1/s1
Reactome pathway
n/an/a 8.70E+3n/an/an/an/an/an/a
Neurocrine Biosciences, Inc.
Curated by ChEMBL
Assay Description
Inhibition of dopamine uptake at cloned DAT in rat brain synaptosome
Bioorg Med Chem Lett 18: 3682-6 (2008)
Article DOI: 10.1016/j.bmcl.2008.05.077
BindingDB Entry DOI: 10.7270/Q26974G5
Sodium-dependent serotonin transporter
(Rattus norvegicus (rat))
BDBM50243894
((cis)-1,6-diphenyl-3-aza-bicyclo[3.1.0]hexane | CH...)
Show SMILES C1NC[C@@]2([C@H]1[C@H]2c1ccccc1)c1ccccc1 |r|
Show InChI InChI=1S/C17H17N/c1-3-7-13(8-4-1)16-15-11-18-12-17(15,16)14-9-5-2-6-10-14/h1-10,15-16,18H,11-12H2/t15-,16-,17+/m1/s1
n/an/a 240n/an/an/an/an/an/a
Neurocrine Biosciences, Inc.
Curated by ChEMBL
Assay Description
Inhibition of serotonin uptake at SERT in rat brain synaptosome
Bioorg Med Chem Lett 18: 3682-6 (2008)
Article DOI: 10.1016/j.bmcl.2008.05.077
BindingDB Entry DOI: 10.7270/Q26974G5