BDBM50243919 (R)-2-((3,4-dichlorophenyl)(methyl)amino)-N-methyl-N-(1-phenyl-2-(pyrrolidin-1-yl)ethyl)acetamide::CHEMBL488470
SMILES: CN(CC(=O)N(C)[C@@H](CN1CCCC1)c1ccccc1)c1ccc(Cl)c(Cl)c1
InChI Key: InChIKey=ZAFTWOVROZMXTK-NRFANRHFSA-N
Data: 1 KI  1 EC50
Activity Spreadsheet -- Enzyme Inhibition Constant Data from BindingDB
Found 2 hits for monomerid = 50243919
Trg + Lig
Ki
nM
ΔG°
kcal/mole
IC50
nM
Kd
nM
EC50/IC50
nM
koff
s-1
kon
M-1s-1
pHTemp
°C
Urotensin II receptor
(Homo sapiens (Human))
BDBM50243919
((R)-2-((3,4-dichlorophenyl)(methyl)amino)-N-methyl...)
Show SMILES CN(CC(=O)N(C)[C@@H](CN1CCCC1)c1ccccc1)c1ccc(Cl)c(Cl)c1 |r|
Show InChI InChI=1S/C22H27Cl2N3O/c1-25(18-10-11-19(23)20(24)14-18)16-22(28)26(2)21(15-27-12-6-7-13-27)17-8-4-3-5-9-17/h3-5,8-11,14,21H,6-7,12-13,15-16H2,1-2H3/t21-/m0/s1
Reactome pathway
13n/an/an/an/an/an/an/an/a
GlaxoSmithKline Pharmaceuticals
Curated by ChEMBL
Assay Description
Binding affinity to human urotensin2 receptor
Bioorg Med Chem Lett 18: 3716-9 (2008)
Article DOI: 10.1016/j.bmcl.2008.05.058
BindingDB Entry DOI: 10.7270/Q2RN37NJ
Kappa-type opioid receptor
(Homo sapiens (Human))
BDBM50243919
((R)-2-((3,4-dichlorophenyl)(methyl)amino)-N-methyl...)
Show SMILES CN(CC(=O)N(C)[C@@H](CN1CCCC1)c1ccccc1)c1ccc(Cl)c(Cl)c1 |r|
Show InChI InChI=1S/C22H27Cl2N3O/c1-25(18-10-11-19(23)20(24)14-18)16-22(28)26(2)21(15-27-12-6-7-13-27)17-8-4-3-5-9-17/h3-5,8-11,14,21H,6-7,12-13,15-16H2,1-2H3/t21-/m0/s1
Reactome pathway
n/an/an/an/a 4n/an/an/an/a
GlaxoSmithKline Pharmaceuticals
Curated by ChEMBL
Assay Description
Agonist activity at kappa opioid receptor (unknown origin)
Bioorg Med Chem Lett 18: 3716-9 (2008)
Article DOI: 10.1016/j.bmcl.2008.05.058
BindingDB Entry DOI: 10.7270/Q2RN37NJ