BDBM50243938 (trans)-1-(3,4-dichlorophenyl)-6-methyl-3-aza-bicyclo[3.1.0]hexane::CHEMBL521058
SMILES: C[C@H]1[C@H]2CNC[C@@]12c1ccc(Cl)c(Cl)c1
InChI Key: InChIKey=AYVHIUIIRXDSCH-VMAXQDLPSA-N
Data: 3 IC50
Activity Spreadsheet -- Enzyme Inhibition Constant Data from BindingDB
Found 3 hits for monomerid = 50243938
Trg + Lig
Ki
nM
ΔG°
kcal/mole
IC50
nM
Kd
nM
EC50/IC50
nM
koff
s-1
kon
M-1s-1
pHTemp
°C
Transporter
(Rattus norvegicus (rat))
BDBM50243938
((trans)-1-(3,4-dichlorophenyl)-6-methyl-3-aza-bicy...)
Show SMILES C[C@H]1[C@H]2CNC[C@@]12c1ccc(Cl)c(Cl)c1 |r|
Show InChI InChI=1S/C12H13Cl2N/c1-7-9-5-15-6-12(7,9)8-2-3-10(13)11(14)4-8/h2-4,7,9,15H,5-6H2,1H3/t7-,9+,12-/m0/s1
Reactome pathway
n/an/a 500n/an/an/an/an/an/a
Neurocrine Biosciences, Inc.
Curated by ChEMBL
Assay Description
Inhibition of norepinephrine uptake at NET in rat brain synaptosome
Bioorg Med Chem Lett 18: 3682-6 (2008)
Article DOI: 10.1016/j.bmcl.2008.05.077
BindingDB Entry DOI: 10.7270/Q26974G5
Sodium-dependent dopamine transporter
(Rattus norvegicus (rat))
BDBM50243938
((trans)-1-(3,4-dichlorophenyl)-6-methyl-3-aza-bicy...)
Show SMILES C[C@H]1[C@H]2CNC[C@@]12c1ccc(Cl)c(Cl)c1 |r|
Show InChI InChI=1S/C12H13Cl2N/c1-7-9-5-15-6-12(7,9)8-2-3-10(13)11(14)4-8/h2-4,7,9,15H,5-6H2,1H3/t7-,9+,12-/m0/s1
Reactome pathway
n/an/a 500n/an/an/an/an/an/a
Neurocrine Biosciences, Inc.
Curated by ChEMBL
Assay Description
Inhibition of dopamine uptake at cloned DAT in rat brain synaptosome
Bioorg Med Chem Lett 18: 3682-6 (2008)
Article DOI: 10.1016/j.bmcl.2008.05.077
BindingDB Entry DOI: 10.7270/Q26974G5
Sodium-dependent serotonin transporter
(Rattus norvegicus (rat))
BDBM50243938
((trans)-1-(3,4-dichlorophenyl)-6-methyl-3-aza-bicy...)
Show SMILES C[C@H]1[C@H]2CNC[C@@]12c1ccc(Cl)c(Cl)c1 |r|
Show InChI InChI=1S/C12H13Cl2N/c1-7-9-5-15-6-12(7,9)8-2-3-10(13)11(14)4-8/h2-4,7,9,15H,5-6H2,1H3/t7-,9+,12-/m0/s1
n/an/a 200n/an/an/an/an/an/a
Neurocrine Biosciences, Inc.
Curated by ChEMBL
Assay Description
Inhibition of serotonin uptake at SERT in rat brain synaptosome
Bioorg Med Chem Lett 18: 3682-6 (2008)
Article DOI: 10.1016/j.bmcl.2008.05.077
BindingDB Entry DOI: 10.7270/Q26974G5