BDBM50243940 (cis)-1-(3,4-dichlorophenyl)-6-phenyl-3-aza-bicyclo[3.1.0]hexane::CHEMBL451785
SMILES: Clc1ccc(cc1Cl)[C@@]12CNC[C@@H]1[C@H]2c1ccccc1
InChI Key: InChIKey=CWFNRUJQSBCROS-XYPHTWIQSA-N
Data: 3 IC50
Activity Spreadsheet -- Enzyme Inhibition Constant Data from BindingDB
Found 3 hits for monomerid = 50243940
Trg + Lig
Ki
nM
ΔG°
kcal/mole
IC50
nM
Kd
nM
EC50/IC50
nM
koff
s-1
kon
M-1s-1
pHTemp
°C
Transporter
(Rattus norvegicus (rat))
BDBM50243940
((cis)-1-(3,4-dichlorophenyl)-6-phenyl-3-aza-bicycl...)
Show SMILES Clc1ccc(cc1Cl)[C@@]12CNC[C@@H]1[C@H]2c1ccccc1 |r|
Show InChI InChI=1S/C17H15Cl2N/c18-14-7-6-12(8-15(14)19)17-10-20-9-13(17)16(17)11-4-2-1-3-5-11/h1-8,13,16,20H,9-10H2/t13-,16-,17+/m1/s1
Reactome pathway
n/an/a 34n/an/an/an/an/an/a
Neurocrine Biosciences, Inc.
Curated by ChEMBL
Assay Description
Inhibition of norepinephrine uptake at NET in rat brain synaptosome
Bioorg Med Chem Lett 18: 3682-6 (2008)
Article DOI: 10.1016/j.bmcl.2008.05.077
BindingDB Entry DOI: 10.7270/Q26974G5
Sodium-dependent dopamine transporter
(Rattus norvegicus (rat))
BDBM50243940
((cis)-1-(3,4-dichlorophenyl)-6-phenyl-3-aza-bicycl...)
Show SMILES Clc1ccc(cc1Cl)[C@@]12CNC[C@@H]1[C@H]2c1ccccc1 |r|
Show InChI InChI=1S/C17H15Cl2N/c18-14-7-6-12(8-15(14)19)17-10-20-9-13(17)16(17)11-4-2-1-3-5-11/h1-8,13,16,20H,9-10H2/t13-,16-,17+/m1/s1
Reactome pathway
n/an/a 360n/an/an/an/an/an/a
Neurocrine Biosciences, Inc.
Curated by ChEMBL
Assay Description
Inhibition of dopamine uptake at cloned DAT in rat brain synaptosome
Bioorg Med Chem Lett 18: 3682-6 (2008)
Article DOI: 10.1016/j.bmcl.2008.05.077
BindingDB Entry DOI: 10.7270/Q26974G5
Sodium-dependent serotonin transporter
(Rattus norvegicus (rat))
BDBM50243940
((cis)-1-(3,4-dichlorophenyl)-6-phenyl-3-aza-bicycl...)
Show SMILES Clc1ccc(cc1Cl)[C@@]12CNC[C@@H]1[C@H]2c1ccccc1 |r|
Show InChI InChI=1S/C17H15Cl2N/c18-14-7-6-12(8-15(14)19)17-10-20-9-13(17)16(17)11-4-2-1-3-5-11/h1-8,13,16,20H,9-10H2/t13-,16-,17+/m1/s1
n/an/a 350n/an/an/an/an/an/a
Neurocrine Biosciences, Inc.
Curated by ChEMBL
Assay Description
Inhibition of serotonin uptake at SERT in rat brain synaptosome
Bioorg Med Chem Lett 18: 3682-6 (2008)
Article DOI: 10.1016/j.bmcl.2008.05.077
BindingDB Entry DOI: 10.7270/Q26974G5