BDBM50243986 1-(benzofuran-2-yl)-3-aza-bicyclo[3.1.0]hexane::CHEMBL509158
SMILES: C1C2CNCC12c1cc2ccccc2o1
InChI Key: InChIKey=FRXUZFQLSGFGPV-UHFFFAOYSA-N
Data: 3 IC50
Activity Spreadsheet -- Enzyme Inhibition Constant Data from BindingDB
Found 3 hits for monomerid = 50243986
Trg + Lig
Ki
nM
ΔG°
kcal/mole
IC50
nM
Kd
nM
EC50/IC50
nM
koff
s-1
kon
M-1s-1
pHTemp
°C
Transporter
(Rattus norvegicus (rat))
BDBM50243986
(1-(benzofuran-2-yl)-3-aza-bicyclo[3.1.0]hexane | C...)
Show SMILES C1C2CNCC12c1cc2ccccc2o1
Show InChI InChI=1S/C13H13NO/c1-2-4-11-9(3-1)5-12(15-11)13-6-10(13)7-14-8-13/h1-5,10,14H,6-8H2
Reactome pathway
n/an/a 48n/an/an/an/an/an/a
Neurocrine Biosciences, Inc.
Curated by ChEMBL
Assay Description
Inhibition of norepinephrine uptake at NET in rat brain synaptosome
Bioorg Med Chem Lett 18: 3682-6 (2008)
Article DOI: 10.1016/j.bmcl.2008.05.077
BindingDB Entry DOI: 10.7270/Q26974G5
Sodium-dependent dopamine transporter
(Rattus norvegicus (rat))
BDBM50243986
(1-(benzofuran-2-yl)-3-aza-bicyclo[3.1.0]hexane | C...)
Show SMILES C1C2CNCC12c1cc2ccccc2o1
Show InChI InChI=1S/C13H13NO/c1-2-4-11-9(3-1)5-12(15-11)13-6-10(13)7-14-8-13/h1-5,10,14H,6-8H2
Reactome pathway
n/an/a 330n/an/an/an/an/an/a
Neurocrine Biosciences, Inc.
Curated by ChEMBL
Assay Description
Inhibition of dopamine uptake at cloned DAT in rat brain synaptosome
Bioorg Med Chem Lett 18: 3682-6 (2008)
Article DOI: 10.1016/j.bmcl.2008.05.077
BindingDB Entry DOI: 10.7270/Q26974G5
Sodium-dependent serotonin transporter
(Rattus norvegicus (rat))
BDBM50243986
(1-(benzofuran-2-yl)-3-aza-bicyclo[3.1.0]hexane | C...)
Show SMILES C1C2CNCC12c1cc2ccccc2o1
Show InChI InChI=1S/C13H13NO/c1-2-4-11-9(3-1)5-12(15-11)13-6-10(13)7-14-8-13/h1-5,10,14H,6-8H2
n/an/a 140n/an/an/an/an/an/a
Neurocrine Biosciences, Inc.
Curated by ChEMBL
Assay Description
Inhibition of serotonin uptake at SERT in rat brain synaptosome
Bioorg Med Chem Lett 18: 3682-6 (2008)
Article DOI: 10.1016/j.bmcl.2008.05.077
BindingDB Entry DOI: 10.7270/Q26974G5