BDBM50243989 1-(thiophen-2-yl)-3-aza-bicyclo[3.1.0]hexane::CHEMBL500739
SMILES: C1C2CNCC12c1cccs1
InChI Key: InChIKey=DMILNTFRFSJCOO-UHFFFAOYSA-N
Data: 3 IC50
Activity Spreadsheet -- Enzyme Inhibition Constant Data from BindingDB
Found 3 hits for monomerid = 50243989
Trg + Lig
Ki
nM
ΔG°
kcal/mole
IC50
nM
Kd
nM
EC50/IC50
nM
koff
s-1
kon
M-1s-1
pHTemp
°C
Transporter
(Rattus norvegicus (rat))
BDBM50243989
(1-(thiophen-2-yl)-3-aza-bicyclo[3.1.0]hexane | CHE...)
Show SMILES C1C2CNCC12c1cccs1
Show InChI InChI=1S/C9H11NS/c1-2-8(11-3-1)9-4-7(9)5-10-6-9/h1-3,7,10H,4-6H2
Reactome pathway
n/an/a 130n/an/an/an/an/an/a
Neurocrine Biosciences, Inc.
Curated by ChEMBL
Assay Description
Inhibition of norepinephrine uptake at NET in rat brain synaptosome
Bioorg Med Chem Lett 18: 3682-6 (2008)
Article DOI: 10.1016/j.bmcl.2008.05.077
BindingDB Entry DOI: 10.7270/Q26974G5
Sodium-dependent dopamine transporter
(Rattus norvegicus (rat))
BDBM50243989
(1-(thiophen-2-yl)-3-aza-bicyclo[3.1.0]hexane | CHE...)
Show SMILES C1C2CNCC12c1cccs1
Show InChI InChI=1S/C9H11NS/c1-2-8(11-3-1)9-4-7(9)5-10-6-9/h1-3,7,10H,4-6H2
Reactome pathway
n/an/a 7.50E+3n/an/an/an/an/an/a
Neurocrine Biosciences, Inc.
Curated by ChEMBL
Assay Description
Inhibition of dopamine uptake at cloned DAT in rat brain synaptosome
Bioorg Med Chem Lett 18: 3682-6 (2008)
Article DOI: 10.1016/j.bmcl.2008.05.077
BindingDB Entry DOI: 10.7270/Q26974G5
Sodium-dependent serotonin transporter
(Rattus norvegicus (rat))
BDBM50243989
(1-(thiophen-2-yl)-3-aza-bicyclo[3.1.0]hexane | CHE...)
Show SMILES C1C2CNCC12c1cccs1
Show InChI InChI=1S/C9H11NS/c1-2-8(11-3-1)9-4-7(9)5-10-6-9/h1-3,7,10H,4-6H2
n/an/a 4.50E+3n/an/an/an/an/an/a
Neurocrine Biosciences, Inc.
Curated by ChEMBL
Assay Description
Inhibition of serotonin uptake at SERT in rat brain synaptosome
Bioorg Med Chem Lett 18: 3682-6 (2008)
Article DOI: 10.1016/j.bmcl.2008.05.077
BindingDB Entry DOI: 10.7270/Q26974G5