BDBM50244081 (1S,5S)-1-(5-fluorobenzo[b]thiophen-2-yl)-3-aza-bicyclo[3.1.0]hexane::CHEMBL444992
SMILES: Fc1ccc2sc(cc2c1)[C@@]12C[C@@H]1CNC2
InChI Key: InChIKey=CFWHOTMOLFXUOB-NOZJJQNGSA-N
Data: 3 IC50
Activity Spreadsheet -- Enzyme Inhibition Constant Data from BindingDB
Found 3 hits for monomerid = 50244081
Trg + Lig
Ki
nM
ΔG°
kcal/mole
IC50
nM
Kd
nM
EC50/IC50
nM
koff
s-1
kon
M-1s-1
pHTemp
°C
Sodium-dependent serotonin transporter
(Rattus norvegicus (rat))
BDBM50244081
((1S,5S)-1-(5-fluorobenzo[b]thiophen-2-yl)-3-aza-bi...)
Show SMILES Fc1ccc2sc(cc2c1)[C@@]12C[C@@H]1CNC2 |r|
Show InChI InChI=1S/C13H12FNS/c14-10-1-2-11-8(3-10)4-12(16-11)13-5-9(13)6-15-7-13/h1-4,9,15H,5-7H2/t9-,13-/m1/s1
n/an/a 33n/an/an/an/an/an/a
Neurocrine Biosciences, Inc.
Curated by ChEMBL
Assay Description
Inhibition of serotonin uptake at SERT in rat brain synaptosome
Bioorg Med Chem Lett 18: 3682-6 (2008)
Article DOI: 10.1016/j.bmcl.2008.05.077
BindingDB Entry DOI: 10.7270/Q26974G5
Sodium-dependent dopamine transporter
(Rattus norvegicus (rat))
BDBM50244081
((1S,5S)-1-(5-fluorobenzo[b]thiophen-2-yl)-3-aza-bi...)
Show SMILES Fc1ccc2sc(cc2c1)[C@@]12C[C@@H]1CNC2 |r|
Show InChI InChI=1S/C13H12FNS/c14-10-1-2-11-8(3-10)4-12(16-11)13-5-9(13)6-15-7-13/h1-4,9,15H,5-7H2/t9-,13-/m1/s1
Reactome pathway
n/an/a 420n/an/an/an/an/an/a
Neurocrine Biosciences, Inc.
Curated by ChEMBL
Assay Description
Inhibition of dopamine uptake at cloned DAT in rat brain synaptosome
Bioorg Med Chem Lett 18: 3682-6 (2008)
Article DOI: 10.1016/j.bmcl.2008.05.077
BindingDB Entry DOI: 10.7270/Q26974G5
Transporter
(Rattus norvegicus (rat))
BDBM50244081
((1S,5S)-1-(5-fluorobenzo[b]thiophen-2-yl)-3-aza-bi...)
Show SMILES Fc1ccc2sc(cc2c1)[C@@]12C[C@@H]1CNC2 |r|
Show InChI InChI=1S/C13H12FNS/c14-10-1-2-11-8(3-10)4-12(16-11)13-5-9(13)6-15-7-13/h1-4,9,15H,5-7H2/t9-,13-/m1/s1
Reactome pathway
n/an/a 67n/an/an/an/an/an/a
Neurocrine Biosciences, Inc.
Curated by ChEMBL
Assay Description
Inhibition of norepinephrine uptake at NET in rat brain synaptosome
Bioorg Med Chem Lett 18: 3682-6 (2008)
Article DOI: 10.1016/j.bmcl.2008.05.077
BindingDB Entry DOI: 10.7270/Q26974G5