BDBM50244198 4-(((4-cyclohexylphenyl)(1-methyl-1H-benzo[d]imidazol-2-yl)amino)methyl)-N-(1H-tetrazol-5-yl)benzamide::CHEMBL459208
SMILES: Cn1c(nc2ccccc12)N(Cc1ccc(cc1)C(=O)Nc1nnn[nH]1)c1ccc(cc1)C1CCCCC1
InChI Key: InChIKey=VSANTXVSKFKREH-UHFFFAOYSA-N
Data: 2 IC50
Activity Spreadsheet -- Enzyme Inhibition Constant Data from BindingDB
Found 2 hits for monomerid = 50244198
Trg + Lig
Ki
nM
ΔG°
kcal/mole
IC50
nM
Kd
nM
EC50/IC50
nM
koff
s-1
kon
M-1s-1
pHTemp
°C
Glucagon receptor
(Homo sapiens (Human))
BDBM50244198
(4-(((4-cyclohexylphenyl)(1-methyl-1H-benzo[d]imida...)
Show SMILES Cn1c(nc2ccccc12)N(Cc1ccc(cc1)C(=O)Nc1nnn[nH]1)c1ccc(cc1)C1CCCCC1
Show InChI InChI=1S/C29H30N8O/c1-36-26-10-6-5-9-25(26)30-29(36)37(24-17-15-22(16-18-24)21-7-3-2-4-8-21)19-20-11-13-23(14-12-20)27(38)31-28-32-34-35-33-28/h5-6,9-18,21H,2-4,7-8,19H2,1H3,(H2,31,32,33,34,35,38)
n/an/a 9n/an/an/an/an/an/a
Merck Research Laboratories
Curated by ChEMBL
Assay Description
Displacement of [125I]glucagon from human GCGR expressed in CHO cells
Bioorg Med Chem Lett 18: 3701-5 (2008)
Article DOI: 10.1016/j.bmcl.2008.05.072
BindingDB Entry DOI: 10.7270/Q26Q1X25
Glucagon receptor
(Homo sapiens (Human))
BDBM50244198
(4-(((4-cyclohexylphenyl)(1-methyl-1H-benzo[d]imida...)
Show SMILES Cn1c(nc2ccccc12)N(Cc1ccc(cc1)C(=O)Nc1nnn[nH]1)c1ccc(cc1)C1CCCCC1
Show InChI InChI=1S/C29H30N8O/c1-36-26-10-6-5-9-25(26)30-29(36)37(24-17-15-22(16-18-24)21-7-3-2-4-8-21)19-20-11-13-23(14-12-20)27(38)31-28-32-34-35-33-28/h5-6,9-18,21H,2-4,7-8,19H2,1H3,(H2,31,32,33,34,35,38)
n/an/a 28n/an/an/an/an/an/a
Merck Research Laboratories
Curated by ChEMBL
Assay Description
Antagonist activity against human GCGR expressed in CHO cells assessed as glucagon-induced cAMP accumulation
Bioorg Med Chem Lett 18: 3701-5 (2008)
Article DOI: 10.1016/j.bmcl.2008.05.072
BindingDB Entry DOI: 10.7270/Q26Q1X25