BDBM50244210 CHEMBL4095995
SMILES: [H][C@]12[C@H](C(O)=O)[C@@]1([H])[C@@](N)(C[C@@H]2NC(=O)c1ccccc1)C(O)=O
InChI Key: InChIKey=ZDVZEEBBIZFFGQ-DMZJWBPISA-N
Data: 2 KI  2 EC50
Activity Spreadsheet -- Enzyme Inhibition Constant Data from BindingDB
Found 4 hits for monomerid = 50244210
Trg + Lig
Ki
nM
ΔG°
kcal/mole
IC50
nM
Kd
nM
EC50/IC50
nM
koff
s-1
kon
M-1s-1
pHTemp
°C
Metabotropic glutamate receptor 3
(Homo sapiens (Human))
BDBM50244210
(CHEMBL4095995)
Show SMILES [H][C@]12[C@H](C(O)=O)[C@@]1([H])[C@@](N)(C[C@@H]2NC(=O)c1ccccc1)C(O)=O |r|
Show InChI InChI=1S/C15H16N2O5/c16-15(14(21)22)6-8(9-10(11(9)15)13(19)20)17-12(18)7-4-2-1-3-5-7/h1-5,8-11H,6,16H2,(H,17,18)(H,19,20)(H,21,22)/t8-,9-,10-,11-,15-/m0/s1
6.80n/an/an/an/an/an/an/an/a
TBA
Curated by ChEMBL
Assay Description
Compound was tested for antagonistic activity against D2 receptor from rat striatum, used [3H]raclopride as radioligand
J Med Chem 61: 2303-2328 (2018)
Article DOI: 10.1021/acs.jmedchem.7b01481
BindingDB Entry DOI: 10.7270/Q2W95CM9
Metabotropic glutamate receptor 2
(Homo sapiens (Human))
BDBM50244210
(CHEMBL4095995)
Show SMILES [H][C@]12[C@H](C(O)=O)[C@@]1([H])[C@@](N)(C[C@@H]2NC(=O)c1ccccc1)C(O)=O |r|
Show InChI InChI=1S/C15H16N2O5/c16-15(14(21)22)6-8(9-10(11(9)15)13(19)20)17-12(18)7-4-2-1-3-5-7/h1-5,8-11H,6,16H2,(H,17,18)(H,19,20)(H,21,22)/t8-,9-,10-,11-,15-/m0/s1
294n/an/an/an/an/an/an/an/a
TBA
Curated by ChEMBL
Assay Description
Displacement of [3H]-LY459477 from recombinant human mGlu2 receptor expressed in HEK cell membranes after 90 mins by liquid scintillation counting
J Med Chem 61: 2303-2328 (2018)
Article DOI: 10.1021/acs.jmedchem.7b01481
BindingDB Entry DOI: 10.7270/Q2W95CM9
Metabotropic glutamate receptor 3
(Homo sapiens (Human))
BDBM50244210
(CHEMBL4095995)
Show SMILES [H][C@]12[C@H](C(O)=O)[C@@]1([H])[C@@](N)(C[C@@H]2NC(=O)c1ccccc1)C(O)=O |r|
Show InChI InChI=1S/C15H16N2O5/c16-15(14(21)22)6-8(9-10(11(9)15)13(19)20)17-12(18)7-4-2-1-3-5-7/h1-5,8-11H,6,16H2,(H,17,18)(H,19,20)(H,21,22)/t8-,9-,10-,11-,15-/m0/s1
n/an/an/an/a 5n/an/an/an/a
TBA
Curated by ChEMBL
Assay Description
Agonist activity at human mGlu3 receptor expressed in HEK cells assessed as inhibition of forskolin-stimulated cAMP formation after 20 mins by HTRF a...
J Med Chem 61: 2303-2328 (2018)
Article DOI: 10.1021/acs.jmedchem.7b01481
BindingDB Entry DOI: 10.7270/Q2W95CM9
Metabotropic glutamate receptor 2
(Homo sapiens (Human))
BDBM50244210
(CHEMBL4095995)
Show SMILES [H][C@]12[C@H](C(O)=O)[C@@]1([H])[C@@](N)(C[C@@H]2NC(=O)c1ccccc1)C(O)=O |r|
Show InChI InChI=1S/C15H16N2O5/c16-15(14(21)22)6-8(9-10(11(9)15)13(19)20)17-12(18)7-4-2-1-3-5-7/h1-5,8-11H,6,16H2,(H,17,18)(H,19,20)(H,21,22)/t8-,9-,10-,11-,15-/m0/s1
n/an/an/an/a 20n/an/an/an/a
TBA
Curated by ChEMBL
Assay Description
Agonist activity at human mGlu2 receptor expressed in HEK cells assessed as inhibition of forskolin-stimulated cAMP formation after 20 mins by HTRF a...
J Med Chem 61: 2303-2328 (2018)
Article DOI: 10.1021/acs.jmedchem.7b01481
BindingDB Entry DOI: 10.7270/Q2W95CM9