BDBM50244298 CHEMBL472325::trans-4-(((5-bromo-1-methyl-1H-benzo[d]imidazol-2-yl)(4-tert-butylcyclohexyl)amino)methyl)-N-(1H-tetrazol-5-yl)benzamide
SMILES: Cn1c(nc2cc(Br)ccc12)N(Cc1ccc(cc1)C(=O)Nc1nnn[nH]1)[C@H]1CC[C@@H](CC1)C(C)(C)C
InChI Key: InChIKey=LYRGDVXFHAZFHO-XUTJKUGGSA-N
Data: 2 IC50
Activity Spreadsheet -- Enzyme Inhibition Constant Data from BindingDB
Found 2 hits for monomerid = 50244298
Trg + Lig
Ki
nM
ΔG°
kcal/mole
IC50
nM
Kd
nM
EC50/IC50
nM
koff
s-1
kon
M-1s-1
pHTemp
°C
Glucagon receptor
(Homo sapiens (Human))
BDBM50244298
(CHEMBL472325 | trans-4-(((5-bromo-1-methyl-1H-benz...)
Show SMILES Cn1c(nc2cc(Br)ccc12)N(Cc1ccc(cc1)C(=O)Nc1nnn[nH]1)[C@H]1CC[C@@H](CC1)C(C)(C)C |r,wU:27.30,wD:30.37,(-7.9,-48.6,;-7.13,-47.27,;-5.7,-46.67,;-5.82,-45.14,;-7.32,-44.78,;-8.06,-43.44,;-9.59,-43.4,;-10.33,-42.04,;-10.4,-44.72,;-9.66,-46.06,;-8.13,-46.1,;-4.37,-47.45,;-4.38,-48.99,;-3.05,-49.77,;-1.72,-49,;-.39,-49.78,;-.4,-51.32,;-1.74,-52.08,;-3.07,-51.3,;.93,-52.1,;.92,-53.64,;2.27,-51.34,;3.6,-52.12,;4.12,-53.57,;5.66,-53.53,;6.1,-52.05,;4.83,-51.18,;-3.04,-46.69,;-3.04,-45.15,;-1.69,-44.39,;-.36,-45.18,;-.38,-46.72,;-1.71,-47.47,;.98,-44.42,;2.3,-43.64,;1.75,-45.75,;.21,-43.08,)|
Show InChI InChI=1S/C27H33BrN8O/c1-27(2,3)19-9-12-21(13-10-19)36(26-29-22-15-20(28)11-14-23(22)35(26)4)16-17-5-7-18(8-6-17)24(37)30-25-31-33-34-32-25/h5-8,11,14-15,19,21H,9-10,12-13,16H2,1-4H3,(H2,30,31,32,33,34,37)/t19-,21-
n/an/a 7n/an/an/an/an/an/a
Merck Research Laboratories
Curated by ChEMBL
Assay Description
Displacement of [125I]glucagon from human GCGR expressed in CHO cells
Bioorg Med Chem Lett 18: 3701-5 (2008)
Article DOI: 10.1016/j.bmcl.2008.05.072
BindingDB Entry DOI: 10.7270/Q26Q1X25
Glucagon receptor
(Homo sapiens (Human))
BDBM50244298
(CHEMBL472325 | trans-4-(((5-bromo-1-methyl-1H-benz...)
Show SMILES Cn1c(nc2cc(Br)ccc12)N(Cc1ccc(cc1)C(=O)Nc1nnn[nH]1)[C@H]1CC[C@@H](CC1)C(C)(C)C |r,wU:27.30,wD:30.37,(-7.9,-48.6,;-7.13,-47.27,;-5.7,-46.67,;-5.82,-45.14,;-7.32,-44.78,;-8.06,-43.44,;-9.59,-43.4,;-10.33,-42.04,;-10.4,-44.72,;-9.66,-46.06,;-8.13,-46.1,;-4.37,-47.45,;-4.38,-48.99,;-3.05,-49.77,;-1.72,-49,;-.39,-49.78,;-.4,-51.32,;-1.74,-52.08,;-3.07,-51.3,;.93,-52.1,;.92,-53.64,;2.27,-51.34,;3.6,-52.12,;4.12,-53.57,;5.66,-53.53,;6.1,-52.05,;4.83,-51.18,;-3.04,-46.69,;-3.04,-45.15,;-1.69,-44.39,;-.36,-45.18,;-.38,-46.72,;-1.71,-47.47,;.98,-44.42,;2.3,-43.64,;1.75,-45.75,;.21,-43.08,)|
Show InChI InChI=1S/C27H33BrN8O/c1-27(2,3)19-9-12-21(13-10-19)36(26-29-22-15-20(28)11-14-23(22)35(26)4)16-17-5-7-18(8-6-17)24(37)30-25-31-33-34-32-25/h5-8,11,14-15,19,21H,9-10,12-13,16H2,1-4H3,(H2,30,31,32,33,34,37)/t19-,21-
n/an/a 62n/an/an/an/an/an/a
Merck Research Laboratories
Curated by ChEMBL
Assay Description
Antagonist activity against human GCGR expressed in CHO cells assessed as glucagon-induced cAMP accumulation
Bioorg Med Chem Lett 18: 3701-5 (2008)
Article DOI: 10.1016/j.bmcl.2008.05.072
BindingDB Entry DOI: 10.7270/Q26Q1X25