BDBM50244492 CHEMBL4087543
SMILES: CC[C@H]1CN(CCN1c1ccc(Nc2cc(cn(C)c2=O)-c2ccnc(N3CCn4c5CC(C)(C)Cc5cc4C3=O)c2CO)nc1)C1COC1
InChI Key: InChIKey=MPJFLHSKWXWPRR-SANMLTNESA-N
Data: 1 KI  1 IC50
Activity Spreadsheet -- Enzyme Inhibition Constant Data from BindingDB
Found 2 hits for monomerid = 50244492
Trg + Lig
Ki
nM
ΔG°
kcal/mole
IC50
nM
Kd
nM
EC50/IC50
nM
koff
s-1
kon
M-1s-1
pHTemp
°C
Tyrosine-protein kinase BTK
(Homo sapiens (Human))
BDBM50244492
(CHEMBL4087543)
Show SMILES CC[C@H]1CN(CCN1c1ccc(Nc2cc(cn(C)c2=O)-c2ccnc(N3CCn4c5CC(C)(C)Cc5cc4C3=O)c2CO)nc1)C1COC1 |r|
Show InChI InChI=1S/C38H46N8O4/c1-5-26-20-43(28-22-50-23-28)10-11-44(26)27-6-7-34(40-18-27)41-31-14-25(19-42(4)36(31)48)29-8-9-39-35(30(29)21-47)46-13-12-45-32(37(46)49)15-24-16-38(2,3)17-33(24)45/h6-9,14-15,18-19,26,28,47H,5,10-13,16-17,20-23H2,1-4H3,(H,40,41)/t26-/m0/s1
NCI pathway
Reactome pathway
0.960n/an/an/an/an/an/an/an/a
Genentech
Curated by ChEMBL
Assay Description
Inhibition of human recombinant C-terminal polyhistidine tagged BTK (1 to 659 residues)-mediated synthetic peptide substrate phosphorylation expresse...
J Med Chem 61: 2227-2245 (2018)
Article DOI: 10.1021/acs.jmedchem.7b01712
BindingDB Entry DOI: 10.7270/Q2H134F7
Tyrosine-protein kinase BTK
(Homo sapiens (Human))
BDBM50244492
(CHEMBL4087543)
Show SMILES CC[C@H]1CN(CCN1c1ccc(Nc2cc(cn(C)c2=O)-c2ccnc(N3CCn4c5CC(C)(C)Cc5cc4C3=O)c2CO)nc1)C1COC1 |r|
Show InChI InChI=1S/C38H46N8O4/c1-5-26-20-43(28-22-50-23-28)10-11-44(26)27-6-7-34(40-18-27)41-31-14-25(19-42(4)36(31)48)29-8-9-39-35(30(29)21-47)46-13-12-45-32(37(46)49)15-24-16-38(2,3)17-33(24)45/h6-9,14-15,18-19,26,28,47H,5,10-13,16-17,20-23H2,1-4H3,(H,40,41)/t26-/m0/s1
NCI pathway
Reactome pathway
n/an/a 16n/an/an/an/an/an/a
Genentech
Curated by ChEMBL
Assay Description
In vitro inhibitory activity against mu specific tissue of rat vas deferens
J Med Chem 61: 2227-2245 (2018)
Article DOI: 10.1021/acs.jmedchem.7b01712
BindingDB Entry DOI: 10.7270/Q2H134F7