BDBM50244501 CHEMBL4062634
SMILES: COCCN1CCN(CC1)c1ccc(Nc2cc(cn(C)c2=O)-c2ccnc(N3CCn4c5CC(C)(C)Cc5cc4C3=O)c2CO)nc1
InChI Key: InChIKey=NLXRDXKAIUCTPG-UHFFFAOYSA-N
Data: 1 KI  1 IC50
Activity Spreadsheet -- Enzyme Inhibition Constant Data from BindingDB
Found 2 hits for monomerid = 50244501
Trg + Lig
Ki
nM
ΔG°
kcal/mole
IC50
nM
Kd
nM
EC50/IC50
nM
koff
s-1
kon
M-1s-1
pHTemp
°C
Tyrosine-protein kinase BTK
(Homo sapiens (Human))
BDBM50244501
(CHEMBL4062634)
Show SMILES COCCN1CCN(CC1)c1ccc(Nc2cc(cn(C)c2=O)-c2ccnc(N3CCn4c5CC(C)(C)Cc5cc4C3=O)c2CO)nc1
Show InChI InChI=1S/C36H44N8O4/c1-36(2)19-24-18-30-35(47)44(14-13-43(30)31(24)20-36)33-28(23-45)27(7-8-37-33)25-17-29(34(46)40(3)22-25)39-32-6-5-26(21-38-32)42-11-9-41(10-12-42)15-16-48-4/h5-8,17-18,21-22,45H,9-16,19-20,23H2,1-4H3,(H,38,39)
NCI pathway
Reactome pathway
1.20n/an/an/an/an/an/an/an/a
Genentech
Curated by ChEMBL
Assay Description
Inhibition of human recombinant C-terminal polyhistidine tagged BTK (1 to 659 residues)-mediated synthetic peptide substrate phosphorylation expresse...
J Med Chem 61: 2227-2245 (2018)
Article DOI: 10.1021/acs.jmedchem.7b01712
BindingDB Entry DOI: 10.7270/Q2H134F7
Tyrosine-protein kinase BTK
(Homo sapiens (Human))
BDBM50244501
(CHEMBL4062634)
Show SMILES COCCN1CCN(CC1)c1ccc(Nc2cc(cn(C)c2=O)-c2ccnc(N3CCn4c5CC(C)(C)Cc5cc4C3=O)c2CO)nc1
Show InChI InChI=1S/C36H44N8O4/c1-36(2)19-24-18-30-35(47)44(14-13-43(30)31(24)20-36)33-28(23-45)27(7-8-37-33)25-17-29(34(46)40(3)22-25)39-32-6-5-26(21-38-32)42-11-9-41(10-12-42)15-16-48-4/h5-8,17-18,21-22,45H,9-16,19-20,23H2,1-4H3,(H,38,39)
NCI pathway
Reactome pathway
n/an/a 37n/an/an/an/an/an/a
Genentech
Curated by ChEMBL
Assay Description
Inhibition of BTK in human whole blood-derived CD19+ B cells assessed as suppression of anti-IgM stimulated-CD69 expression preincubated for 1 hr fol...
J Med Chem 61: 2227-2245 (2018)
Article DOI: 10.1021/acs.jmedchem.7b01712
BindingDB Entry DOI: 10.7270/Q2H134F7