BDBM50244623 9-(2,6-dimethylstyryl)-N-(4-(dimethylphosphoryl)phenyl)-2-(1H-imidazol-1-yl)-9H-purin-6-amine::CHEMBL455384
SMILES: Cc1cccc(C)c1\C=C\n1cnc2c(Nc3ccc(cc3)P(C)(C)=O)nc(nc12)-n1ccnc1
InChI Key: InChIKey=NWUCBGDFEQGJTP-WYMLVPIESA-N
Data: 2 IC50
Activity Spreadsheet -- Enzyme Inhibition Constant Data from BindingDB
Found 2 hits for monomerid = 50244623
Trg + Lig
Ki
nM
ΔG°
kcal/mole
IC50
nM
Kd
nM
EC50/IC50
nM
koff
s-1
kon
M-1s-1
pHTemp
°C
Tyrosine-protein kinase ABL1
(Homo sapiens (Human))
BDBM50244623
(9-(2,6-dimethylstyryl)-N-(4-(dimethylphosphoryl)ph...)
Show SMILES Cc1cccc(C)c1\C=C\n1cnc2c(Nc3ccc(cc3)P(C)(C)=O)nc(nc12)-n1ccnc1
Show InChI InChI=1S/C26H26N7OP/c1-18-6-5-7-19(2)22(18)12-14-32-17-28-23-24(29-20-8-10-21(11-9-20)35(3,4)34)30-26(31-25(23)32)33-15-13-27-16-33/h5-17H,1-4H3,(H,29,30,31)/b14-12+
Reactome pathway
n/an/a 1.60n/an/an/an/an/an/a
ARIAD Pharmaceuticals, Inc.
Curated by ChEMBL
Assay Description
Inhibition of Abl kinase
Bioorg Med Chem Lett 18: 4907-12 (2008)
Article DOI: 10.1016/j.bmcl.2008.06.042
BindingDB Entry DOI: 10.7270/Q2H41R78
Proto-oncogene tyrosine-protein kinase Src
(Homo sapiens (Human))
BDBM50244623
(9-(2,6-dimethylstyryl)-N-(4-(dimethylphosphoryl)ph...)
Show SMILES Cc1cccc(C)c1\C=C\n1cnc2c(Nc3ccc(cc3)P(C)(C)=O)nc(nc12)-n1ccnc1
Show InChI InChI=1S/C26H26N7OP/c1-18-6-5-7-19(2)22(18)12-14-32-17-28-23-24(29-20-8-10-21(11-9-20)35(3,4)34)30-26(31-25(23)32)33-15-13-27-16-33/h5-17H,1-4H3,(H,29,30,31)/b14-12+
n/an/a<0.460n/an/an/an/an/an/a
ARIAD Pharmaceuticals, Inc.
Curated by ChEMBL
Assay Description
Inhibition of human Src kinase by TR-FRET assay
Bioorg Med Chem Lett 18: 4907-12 (2008)
Article DOI: 10.1016/j.bmcl.2008.06.042
BindingDB Entry DOI: 10.7270/Q2H41R78