BDBM50244876 CHEMBL4075513
SMILES: COC(=O)CCCCCNC(=O)c1ccc(Nc2ncc3cc(C(=O)N(C)C)n(C4CCCC4)c3n2)cc1
InChI Key: InChIKey=CVCRUCYXKUFVAY-UHFFFAOYSA-N
Data: 1 IC50
Activity Spreadsheet -- Enzyme Inhibition Constant Data from BindingDB
Found 1 hit for monomerid = 50244876
Trg + Lig
Ki
nM
ΔG°
kcal/mole
IC50
nM
Kd
nM
EC50/IC50
nM
koff
s-1
kon
M-1s-1
pHTemp
°C
CDK4/Cyclin D3
(Homo sapiens (Human))
BDBM50244876
(CHEMBL4075513)
Show SMILES COC(=O)CCCCCNC(=O)c1ccc(Nc2ncc3cc(C(=O)N(C)C)n(C4CCCC4)c3n2)cc1
Show InChI InChI=1S/C28H36N6O4/c1-33(2)27(37)23-17-20-18-30-28(32-25(20)34(23)22-9-6-7-10-22)31-21-14-12-19(13-15-21)26(36)29-16-8-4-5-11-24(35)38-3/h12-15,17-18,22H,4-11,16H2,1-3H3,(H,29,36)(H,30,31,32)
n/an/a 7.30n/an/an/an/an/an/a
Nankai University
Curated by ChEMBL
Assay Description
Binding affinity towards [3H]quipazine labeled 5-hydroxytryptamine 3 receptor sites in HG108-15
J Med Chem 61: 3166-3192 (2018)
Article DOI: 10.1021/acs.jmedchem.8b00209
BindingDB Entry DOI: 10.7270/Q2KS6TZK