BDBM50244899 CHEMBL4092039
SMILES: CCCCCC(=O)Nc1ccc(Nc2ncc3cc(C(=O)N(C)C)n(C4CCCC4)c3n2)cc1
InChI Key: InChIKey=LDGOUFROEBYKNR-UHFFFAOYSA-N
Data: 2 IC50
Activity Spreadsheet -- Enzyme Inhibition Constant Data from BindingDB
Found 2 hits for monomerid = 50244899
Trg + Lig
Ki
nM
ΔG°
kcal/mole
IC50
nM
Kd
nM
EC50/IC50
nM
koff
s-1
kon
M-1s-1
pHTemp
°C
CDK4/Cyclin D3
(Homo sapiens (Human))
BDBM50244899
(CHEMBL4092039)
Show SMILES CCCCCC(=O)Nc1ccc(Nc2ncc3cc(C(=O)N(C)C)n(C4CCCC4)c3n2)cc1
Show InChI InChI=1S/C26H34N6O2/c1-4-5-6-11-23(33)28-19-12-14-20(15-13-19)29-26-27-17-18-16-22(25(34)31(2)3)32(24(18)30-26)21-9-7-8-10-21/h12-17,21H,4-11H2,1-3H3,(H,28,33)(H,27,29,30)
n/an/a 10n/an/an/an/an/an/a
Nankai University
Curated by ChEMBL
Assay Description
Inhibition of recombinant human full length N-terminal GST-tagged CDK4/Cyclin-D3 co-expressed in baculovirus infected sf21 cells using Rb substrate i...
J Med Chem 61: 3166-3192 (2018)
Article DOI: 10.1021/acs.jmedchem.8b00209
BindingDB Entry DOI: 10.7270/Q2KS6TZK
Histone deacetylase 1
(Homo sapiens (Human))
BDBM50244899
(CHEMBL4092039)
Show SMILES CCCCCC(=O)Nc1ccc(Nc2ncc3cc(C(=O)N(C)C)n(C4CCCC4)c3n2)cc1
Show InChI InChI=1S/C26H34N6O2/c1-4-5-6-11-23(33)28-19-12-14-20(15-13-19)29-26-27-17-18-16-22(25(34)31(2)3)32(24(18)30-26)21-9-7-8-10-21/h12-17,21H,4-11H2,1-3H3,(H,28,33)(H,27,29,30)
NCI pathway
Reactome pathway
n/an/a>5.00E+3n/an/an/an/an/an/a
Nankai University
Curated by ChEMBL
Assay Description
Inhibition of HDAC1 (unknown origin)
J Med Chem 61: 3166-3192 (2018)
Article DOI: 10.1021/acs.jmedchem.8b00209
BindingDB Entry DOI: 10.7270/Q2KS6TZK