BDBM50245227 CHEMBL4077431
SMILES: CCCC(C)N1CCC(CC1)N(Cc1ccccc1)C(=O)Nc1ccc(I)cc1
InChI Key: InChIKey=GUOXGNXOFOQBKT-UHFFFAOYSA-N
Data: 1 IC50
Activity Spreadsheet -- Enzyme Inhibition Constant Data from BindingDB
Found 1 hit for monomerid = 50245227
Trg + Lig
Ki
nM
ΔG°
kcal/mole
IC50
nM
Kd
nM
EC50/IC50
nM
koff
s-1
kon
M-1s-1
pHTemp
°C
DCN1-like protein 1
(Homo sapiens)
BDBM50245227
(CHEMBL4077431)
Show SMILES CCCC(C)N1CCC(CC1)N(Cc1ccccc1)C(=O)Nc1ccc(I)cc1
Show InChI InChI=1S/C24H32IN3O/c1-3-7-19(2)27-16-14-23(15-17-27)28(18-20-8-5-4-6-9-20)24(29)26-22-12-10-21(25)11-13-22/h4-6,8-13,19,23H,3,7,14-18H2,1-2H3,(H,26,29)
n/an/a 54n/an/an/an/an/an/a
St. Jude Children's Research Hospital
Curated by ChEMBL
Assay Description
Inhibition of biotin-labeled DCN1 (unknown origin) assessed as reduction in protein interaction with Ac-UBE2M12-AlexaFluor488 after 1 hr by TR-FRET a...
J Med Chem 61: 2694-2706 (2018)
Article DOI: 10.1021/acs.jmedchem.7b01282
BindingDB Entry DOI: 10.7270/Q22V2JHZ