BDBM50245424 4-(2-Chlorophenyl)-9-hydroxy-6-[2-(4H-1,2,4-triazol-3-ylsulfanyl)ethyl]pyrrolo[3,4-c]carbazole-1,3(2H,6H )-dione::CHEMBL513079
SMILES: Oc1ccc2n(CCSc3nnc[nH]3)c3cc(c4C(=O)NC(=O)c4c3c2c1)-c1ccccc1Cl
InChI Key: InChIKey=DMLSEGLMTOIWBO-UHFFFAOYSA-N
Data: 2 IC50
Activity Spreadsheet -- Enzyme Inhibition Constant Data from BindingDB
Found 2 hits for monomerid = 50245424
Trg + Lig
Ki
nM
ΔG°
kcal/mole
IC50
nM
Kd
nM
EC50/IC50
nM
koff
s-1
kon
M-1s-1
pHTemp
°C
Serine/threonine-protein kinase WEE1
(Homo sapiens (Human))
BDBM50245424
(4-(2-Chlorophenyl)-9-hydroxy-6-[2-(4H-1,2,4-triazo...)
Show SMILES Oc1ccc2n(CCSc3nnc[nH]3)c3cc(c4C(=O)NC(=O)c4c3c2c1)-c1ccccc1Cl
Show InChI InChI=1S/C24H16ClN5O3S/c25-16-4-2-1-3-13(16)14-10-18-19(21-20(14)22(32)28-23(21)33)15-9-12(31)5-6-17(15)30(18)7-8-34-24-26-11-27-29-24/h1-6,9-11,31H,7-8H2,(H,26,27,29)(H,28,32,33)
NCI pathway
Reactome pathway
n/an/a 24n/an/an/an/an/an/a
University of Auckland
Curated by ChEMBL
Assay Description
Inhibition of human Wee1 assessed as polyornithine-tyrosine copolymer phosphorylation
Eur J Med Chem 43: 1276-96 (2008)
Article DOI: 10.1016/j.ejmech.2007.07.016
BindingDB Entry DOI: 10.7270/Q26M36MC
Serine/threonine-protein kinase Chk1
(Homo sapiens (Human))
BDBM50245424
(4-(2-Chlorophenyl)-9-hydroxy-6-[2-(4H-1,2,4-triazo...)
Show SMILES Oc1ccc2n(CCSc3nnc[nH]3)c3cc(c4C(=O)NC(=O)c4c3c2c1)-c1ccccc1Cl
Show InChI InChI=1S/C24H16ClN5O3S/c25-16-4-2-1-3-13(16)14-10-18-19(21-20(14)22(32)28-23(21)33)15-9-12(31)5-6-17(15)30(18)7-8-34-24-26-11-27-29-24/h1-6,9-11,31H,7-8H2,(H,26,27,29)(H,28,32,33)
Reactome pathway
n/an/a 420n/an/an/an/an/an/a
University of Auckland
Curated by ChEMBL
Assay Description
Inhibition of Chk1 kinase assessed as GST-Cdc25 phosphorylation by Western blot determination
Eur J Med Chem 43: 1276-96 (2008)
Article DOI: 10.1016/j.ejmech.2007.07.016
BindingDB Entry DOI: 10.7270/Q26M36MC