BDBM50245494 CHEMBL4080004
SMILES: O=c1cc(OCC2COc3ncccc3O2)cc2-c3ccc(cc3CCn12)-c1cncnc1
InChI Key: InChIKey=NIBSOFIQMHADQD-UHFFFAOYSA-N
Data: 1 IC50
Activity Spreadsheet -- Enzyme Inhibition Constant Data from BindingDB
Found 1 hit for monomerid = 50245494
Trg + Lig
Ki
nM
ΔG°
kcal/mole
IC50
nM
Kd
nM
EC50/IC50
nM
koff
s-1
kon
M-1s-1
pHTemp
°C
G-protein coupled receptor 84
(Homo sapiens (Human))
BDBM50245494
(CHEMBL4080004)
Show SMILES O=c1cc(OCC2COc3ncccc3O2)cc2-c3ccc(cc3CCn12)-c1cncnc1
Show InChI InChI=1S/C25H20N4O4/c30-24-10-19(31-13-20-14-32-25-23(33-20)2-1-6-28-25)9-22-21-4-3-16(18-11-26-15-27-12-18)8-17(21)5-7-29(22)24/h1-4,6,8-12,15,20H,5,7,13-14H2
n/an/a 10n/an/an/an/an/an/a
Taipei Medical University
Curated by ChEMBL
Assay Description
Antagonist activity at GPR84 (unknown origin) expressed in cell membranes after 90 mins by [35S]GTPgammaS binding assay
J Med Chem 60: 527-553 (2017)
Article DOI: 10.1021/acs.jmedchem.6b00935
BindingDB Entry DOI: 10.7270/Q29C70V2