BDBM50245544 CHEMBL4067250
SMILES: C[C@@H]1CN(C(=O)C(C)(C)O1)c1cc(ccc1C#N)-c1cc(c2c(N)ncnn12)C(F)(F)F
InChI Key: InChIKey=QBZJCJNDEWAZNF-LLVKDONJSA-N
Data: 3 IC50
Activity Spreadsheet -- Enzyme Inhibition Constant Data from BindingDB
Found 3 hits for monomerid = 50245544
Trg + Lig
Ki
nM
ΔG°
kcal/mole
IC50
nM
Kd
nM
EC50/IC50
nM
koff
s-1
kon
M-1s-1
pHTemp
°C
Phosphatidylinositol 4,5-bisphosphate 3-kinase catalytic subunit delta isoform
(Homo sapiens (Human))
BDBM50245544
(CHEMBL4067250)
Show SMILES C[C@@H]1CN(C(=O)C(C)(C)O1)c1cc(ccc1C#N)-c1cc(c2c(N)ncnn12)C(F)(F)F |r|
Show InChI InChI=1S/C21H19F3N6O2/c1-11-9-29(19(31)20(2,3)32-11)15-6-12(4-5-13(15)8-25)16-7-14(21(22,23)24)17-18(26)27-10-28-30(16)17/h4-7,10-11H,9H2,1-3H3,(H2,26,27,28)/t11-/m1/s1
NCI pathway
Reactome pathway
n/an/a 100n/an/an/an/an/an/a
Bristol-Myers Squibb Company
Curated by ChEMBL
Assay Description
Inhibition of PI3Kdelta in ACD-treated human whole blood assessed as reduction in IFNgammaX production measured after 1 hr
Bioorg Med Chem Lett 27: 2849-2853 (2017)
Article DOI: 10.1016/j.bmcl.2017.01.077
BindingDB Entry DOI: 10.7270/Q25M684R
Phosphatidylinositol 4,5-bisphosphate 3-kinase catalytic subunit delta isoform
(Homo sapiens (Human))
BDBM50245544
(CHEMBL4067250)
Show SMILES C[C@@H]1CN(C(=O)C(C)(C)O1)c1cc(ccc1C#N)-c1cc(c2c(N)ncnn12)C(F)(F)F |r|
Show InChI InChI=1S/C21H19F3N6O2/c1-11-9-29(19(31)20(2,3)32-11)15-6-12(4-5-13(15)8-25)16-7-14(21(22,23)24)17-18(26)27-10-28-30(16)17/h4-7,10-11H,9H2,1-3H3,(H2,26,27,28)/t11-/m1/s1
NCI pathway
Reactome pathway
n/an/a 2.40n/an/an/an/an/an/a
Bristol-Myers Squibb Company
Curated by ChEMBL
Assay Description
Inhibition of PI3Kdelta (unknown origin) after 60 mins using fluorescein-labeled kinase tracer by HTRF assay
Bioorg Med Chem Lett 27: 2849-2853 (2017)
Article DOI: 10.1016/j.bmcl.2017.01.077
BindingDB Entry DOI: 10.7270/Q25M684R
Phosphatidylinositol 4,5-bisphosphate 3-kinase catalytic subunit delta isoform
(Homo sapiens (Human))
BDBM50245544
(CHEMBL4067250)
Show SMILES C[C@@H]1CN(C(=O)C(C)(C)O1)c1cc(ccc1C#N)-c1cc(c2c(N)ncnn12)C(F)(F)F |r|
Show InChI InChI=1S/C21H19F3N6O2/c1-11-9-29(19(31)20(2,3)32-11)15-6-12(4-5-13(15)8-25)16-7-14(21(22,23)24)17-18(26)27-10-28-30(16)17/h4-7,10-11H,9H2,1-3H3,(H2,26,27,28)/t11-/m1/s1
NCI pathway
Reactome pathway
n/an/a 170n/an/an/an/an/an/a
Bristol-Myers Squibb Company
Curated by ChEMBL
Assay Description
Inhibition of PI3Kdelta in ACD-treated human whole blood assessed as reduction in CD69 expression measured after 1 hr
Bioorg Med Chem Lett 27: 2849-2853 (2017)
Article DOI: 10.1016/j.bmcl.2017.01.077
BindingDB Entry DOI: 10.7270/Q25M684R