BDBM50245576 9-hydroxy-6-(2-morpholinoethyl)-4-phenylpyrrolo[3,4-c]carbazole-1,3(2H,6H)-dione::CHEMBL521051
SMILES: Oc1ccc2n(CCN3CCOCC3)c3cc(c4C(=O)NC(=O)c4c3c2c1)-c1ccccc1
InChI Key: InChIKey=BCPILSQMLBGEMM-UHFFFAOYSA-N
Data: 2 IC50
Activity Spreadsheet -- Enzyme Inhibition Constant Data from BindingDB
Found 2 hits for monomerid = 50245576
Trg + Lig
Ki
nM
ΔG°
kcal/mole
IC50
nM
Kd
nM
EC50/IC50
nM
koff
s-1
kon
M-1s-1
pHTemp
°C
Serine/threonine-protein kinase WEE1
(Homo sapiens (Human))
BDBM50245576
(9-hydroxy-6-(2-morpholinoethyl)-4-phenylpyrrolo[3,...)
Show SMILES Oc1ccc2n(CCN3CCOCC3)c3cc(c4C(=O)NC(=O)c4c3c2c1)-c1ccccc1
Show InChI InChI=1S/C26H23N3O4/c30-17-6-7-20-19(14-17)22-21(29(20)9-8-28-10-12-33-13-11-28)15-18(16-4-2-1-3-5-16)23-24(22)26(32)27-25(23)31/h1-7,14-15,30H,8-13H2,(H,27,31,32)
NCI pathway
Reactome pathway
n/an/a 140n/an/an/an/an/an/a
University of Auckland
Curated by ChEMBL
Assay Description
Inhibition of human Wee1 assessed as polyornithine-tyrosine copolymer phosphorylation
Eur J Med Chem 43: 1276-96 (2008)
Article DOI: 10.1016/j.ejmech.2007.07.016
BindingDB Entry DOI: 10.7270/Q26M36MC
Serine/threonine-protein kinase Chk1
(Homo sapiens (Human))
BDBM50245576
(9-hydroxy-6-(2-morpholinoethyl)-4-phenylpyrrolo[3,...)
Show SMILES Oc1ccc2n(CCN3CCOCC3)c3cc(c4C(=O)NC(=O)c4c3c2c1)-c1ccccc1
Show InChI InChI=1S/C26H23N3O4/c30-17-6-7-20-19(14-17)22-21(29(20)9-8-28-10-12-33-13-11-28)15-18(16-4-2-1-3-5-16)23-24(22)26(32)27-25(23)31/h1-7,14-15,30H,8-13H2,(H,27,31,32)
Reactome pathway
n/an/a 280n/an/an/an/an/an/a
University of Auckland
Curated by ChEMBL
Assay Description
Inhibition of Chk1 kinase assessed as GST-Cdc25 phosphorylation by Western blot determination
Eur J Med Chem 43: 1276-96 (2008)
Article DOI: 10.1016/j.ejmech.2007.07.016
BindingDB Entry DOI: 10.7270/Q26M36MC