BDBM50245604 CHEMBL4076040
SMILES: CN1CCN(CC1)C(=O)c1ccc(Nc2cc(cn(C)c2=O)-c2cccc(NC(=O)c3ccc(cc3)C(C)(C)C)c2C)cc1NC(=O)C=C
InChI Key: InChIKey=CVVUBZKRYRLUIA-UHFFFAOYSA-N
Data: 1 IC50
Activity Spreadsheet -- Enzyme Inhibition Constant Data from BindingDB
Found 1 hit for monomerid = 50245604
Trg + Lig
Ki
nM
ΔG°
kcal/mole
IC50
nM
Kd
nM
EC50/IC50
nM
koff
s-1
kon
M-1s-1
pHTemp
°C
Tyrosine-protein kinase BTK
(Homo sapiens (Human))
BDBM50245604
(CHEMBL4076040)
Show SMILES CN1CCN(CC1)C(=O)c1ccc(Nc2cc(cn(C)c2=O)-c2cccc(NC(=O)c3ccc(cc3)C(C)(C)C)c2C)cc1NC(=O)C=C
Show InChI InChI=1S/C39H44N6O4/c1-8-35(46)41-33-23-29(16-17-31(33)37(48)45-20-18-43(6)19-21-45)40-34-22-27(24-44(7)38(34)49)30-10-9-11-32(25(30)2)42-36(47)26-12-14-28(15-13-26)39(3,4)5/h8-17,22-24,40H,1,18-21H2,2-7H3,(H,41,46)(H,42,47)
NCI pathway
Reactome pathway
n/an/a 127n/an/an/an/an/an/a
University of Science and Technology of China
Curated by ChEMBL
Assay Description
Inhibition of full length recombinant human N-terminal His tagged BKT expressed in baculovirus infected Sf9 insect cells using poly (Glu,Tyr)4:1 as s...
Eur J Med Chem 131: 107-125 (2017)
Article DOI: 10.1016/j.ejmech.2017.03.001
BindingDB Entry DOI: 10.7270/Q21V5HCK