BDBM50245615 CHEMBL4068683
SMILES: Cc1ccc(Nc2cc(cn(C)c2=O)-c2cccc(NC(=O)c3ccc(cc3)C(C)(C)C)c2C)cc1NC(=O)C=C
InChI Key: InChIKey=SFCCHGNNSITWQR-UHFFFAOYSA-N
Data: 1 IC50
Activity Spreadsheet -- Enzyme Inhibition Constant Data from BindingDB
Found 1 hit for monomerid = 50245615
Trg + Lig
Ki
nM
ΔG°
kcal/mole
IC50
nM
Kd
nM
EC50/IC50
nM
koff
s-1
kon
M-1s-1
pHTemp
°C
Tyrosine-protein kinase BTK
(Homo sapiens (Human))
BDBM50245615
(CHEMBL4068683)
Show SMILES Cc1ccc(Nc2cc(cn(C)c2=O)-c2cccc(NC(=O)c3ccc(cc3)C(C)(C)C)c2C)cc1NC(=O)C=C
Show InChI InChI=1S/C34H36N4O3/c1-8-31(39)36-29-19-26(17-12-21(29)2)35-30-18-24(20-38(7)33(30)41)27-10-9-11-28(22(27)3)37-32(40)23-13-15-25(16-14-23)34(4,5)6/h8-20,35H,1H2,2-7H3,(H,36,39)(H,37,40)
NCI pathway
Reactome pathway
n/an/a 365n/an/an/an/an/an/a
University of Science and Technology of China
Curated by ChEMBL
Assay Description
Inhibition of full length recombinant human N-terminal His tagged BKT expressed in baculovirus infected Sf9 insect cells using poly (Glu,Tyr)4:1 as s...
Eur J Med Chem 131: 107-125 (2017)
Article DOI: 10.1016/j.ejmech.2017.03.001
BindingDB Entry DOI: 10.7270/Q21V5HCK