BDBM50245618 CHEMBL4071893
SMILES: Cc1c(NC(=O)c2ccc3OCOc3c2)cccc1-c1cc(Nc2ccc(C(=O)N3CCOCC3)c(NC(=O)C=C)c2)c(=O)n(C)c1
InChI Key: InChIKey=OJXUDJGYUXMSAA-UHFFFAOYSA-N
Data: 1 IC50
Activity Spreadsheet -- Enzyme Inhibition Constant Data from BindingDB
Found 1 hit for monomerid = 50245618
Trg + Lig
Ki
nM
ΔG°
kcal/mole
IC50
nM
Kd
nM
EC50/IC50
nM
koff
s-1
kon
M-1s-1
pHTemp
°C
Tyrosine-protein kinase BTK
(Homo sapiens (Human))
BDBM50245618
(CHEMBL4071893)
Show SMILES Cc1c(NC(=O)c2ccc3OCOc3c2)cccc1-c1cc(Nc2ccc(C(=O)N3CCOCC3)c(NC(=O)C=C)c2)c(=O)n(C)c1
Show InChI InChI=1S/C35H33N5O7/c1-4-32(41)37-28-18-24(9-10-26(28)34(43)40-12-14-45-15-13-40)36-29-16-23(19-39(3)35(29)44)25-6-5-7-27(21(25)2)38-33(42)22-8-11-30-31(17-22)47-20-46-30/h4-11,16-19,36H,1,12-15,20H2,2-3H3,(H,37,41)(H,38,42)
NCI pathway
Reactome pathway
n/an/a 282n/an/an/an/an/an/a
University of Science and Technology of China
Curated by ChEMBL
Assay Description
Inhibition of full length recombinant human N-terminal His tagged BKT expressed in baculovirus infected Sf9 insect cells using poly (Glu,Tyr)4:1 as s...
Eur J Med Chem 131: 107-125 (2017)
Article DOI: 10.1016/j.ejmech.2017.03.001
BindingDB Entry DOI: 10.7270/Q21V5HCK