BDBM50245628 CHEMBL4064326
SMILES: Cc1c(NC(=O)c2ccc(cc2)C(F)(F)F)cccc1-c1cc(Nc2ccc(C(=O)N3CCOCC3)c(NC(=O)C=C)c2)c(=O)n(C)c1
InChI Key: InChIKey=PQHMNIBNNTVEFI-UHFFFAOYSA-N
Data: 1 IC50
Activity Spreadsheet -- Enzyme Inhibition Constant Data from BindingDB
Found 1 hit for monomerid = 50245628
Trg + Lig
Ki
nM
ΔG°
kcal/mole
IC50
nM
Kd
nM
EC50/IC50
nM
koff
s-1
kon
M-1s-1
pHTemp
°C
Tyrosine-protein kinase BTK
(Homo sapiens (Human))
BDBM50245628
(CHEMBL4064326)
Show SMILES Cc1c(NC(=O)c2ccc(cc2)C(F)(F)F)cccc1-c1cc(Nc2ccc(C(=O)N3CCOCC3)c(NC(=O)C=C)c2)c(=O)n(C)c1
Show InChI InChI=1S/C35H32F3N5O5/c1-4-31(44)40-29-19-25(12-13-27(29)33(46)43-14-16-48-17-15-43)39-30-18-23(20-42(3)34(30)47)26-6-5-7-28(21(26)2)41-32(45)22-8-10-24(11-9-22)35(36,37)38/h4-13,18-20,39H,1,14-17H2,2-3H3,(H,40,44)(H,41,45)
NCI pathway
Reactome pathway
n/an/a 76n/an/an/an/an/an/a
University of Science and Technology of China
Curated by ChEMBL
Assay Description
Inhibition of full length recombinant human N-terminal His tagged BKT expressed in baculovirus infected Sf9 insect cells using poly (Glu,Tyr)4:1 as s...
Eur J Med Chem 131: 107-125 (2017)
Article DOI: 10.1016/j.ejmech.2017.03.001
BindingDB Entry DOI: 10.7270/Q21V5HCK