BDBM50245911 (4-(4-(1-isopropyl-2-methyl-1H-imidazol-5-yl)pyrimidin-2-ylamino)phenyl)((S)-3-(methyl(propyl)amino)pyrrolidin-1-yl)methanone::CHEMBL518826
SMILES: CCCN(C)[C@H]1CCN(C1)C(=O)c1ccc(Nc2nccc(n2)-c2cnc(C)n2C(C)C)cc1
InChI Key: InChIKey=XIRBBABZYUQIMH-QFIPXVFZSA-N
Data: 2 IC50
Activity Spreadsheet -- Enzyme Inhibition Constant Data from BindingDB
Found 2 hits for monomerid = 50245911
Trg + Lig
Ki
nM
ΔG°
kcal/mole
IC50
nM
Kd
nM
EC50/IC50
nM
koff
s-1
kon
M-1s-1
pHTemp
°C
Cyclin-dependent kinase 2
(Homo sapiens (Human))
BDBM50245911
((4-(4-(1-isopropyl-2-methyl-1H-imidazol-5-yl)pyrim...)
Show SMILES CCCN(C)[C@H]1CCN(C1)C(=O)c1ccc(Nc2nccc(n2)-c2cnc(C)n2C(C)C)cc1 |r|
Show InChI InChI=1S/C26H35N7O/c1-6-14-31(5)22-12-15-32(17-22)25(34)20-7-9-21(10-8-20)29-26-27-13-11-23(30-26)24-16-28-19(4)33(24)18(2)3/h7-11,13,16,18,22H,6,12,14-15,17H2,1-5H3,(H,27,29,30)/t22-/m0/s1
NCI pathway
Reactome pathway
n/an/a 4n/an/an/an/an/an/a
AstraZeneca Pharmaceuticals
Curated by ChEMBL
Assay Description
Inhibition of CDK2 (unknown origin)
Bioorg Med Chem Lett 18: 6369-73 (2008)
Article DOI: 10.1016/j.bmcl.2008.10.102
BindingDB Entry DOI: 10.7270/Q2XW4JNM
Cyclin-dependent kinase 1
(Homo sapiens (Human))
BDBM50245911
((4-(4-(1-isopropyl-2-methyl-1H-imidazol-5-yl)pyrim...)
Show SMILES CCCN(C)[C@H]1CCN(C1)C(=O)c1ccc(Nc2nccc(n2)-c2cnc(C)n2C(C)C)cc1 |r|
Show InChI InChI=1S/C26H35N7O/c1-6-14-31(5)22-12-15-32(17-22)25(34)20-7-9-21(10-8-20)29-26-27-13-11-23(30-26)24-16-28-19(4)33(24)18(2)3/h7-11,13,16,18,22H,6,12,14-15,17H2,1-5H3,(H,27,29,30)/t22-/m0/s1
Reactome pathway
n/an/a 120n/an/an/an/an/an/a
AstraZeneca Pharmaceuticals
Curated by ChEMBL
Assay Description
Inhibition of CDK1 (unknown origin)
Bioorg Med Chem Lett 18: 6369-73 (2008)
Article DOI: 10.1016/j.bmcl.2008.10.102
BindingDB Entry DOI: 10.7270/Q2XW4JNM