null
SMILES: Cc1ccc(cc1)S(=O)(=O)C1=CC(=O)c2ccccc2C1=O
InChI Key: InChIKey=UCFUGRHGHVYUOA-UHFFFAOYSA-N
Activity Spreadsheet -- Enzyme Inhibition Constant Data from BindingDB
Found 2 hits for monomerid = 50245928
Trg + Lig
Ki
nM
ΔG°
kcal/mole
IC50
nM
Kd
nM
EC50/IC50
nM
koff
s-1
kon
M-1s-1
pHTemp
°C
3-oxoacyl-[acyl-carrier-protein] synthase 3
(Mycobacterium tuberculosis)
BDBM50245928
(2-tosylnaphthalene-1,4-dione | CHEMBL454282)
Show SMILES Cc1ccc(cc1)S(=O)(=O)C1=CC(=O)c2ccccc2C1=O |t:11|
Show InChI InChI=1S/C17H12O4S/c1-11-6-8-12(9-7-11)22(20,21)16-10-15(18)13-4-2-3-5-14(13)17(16)19/h2-10H,1H3
n/an/a 1.99n/an/an/an/an/an/a
Portland State University
Curated by ChEMBL
Assay Description
Inhibition of Mycobacterium tuberculosis FabH
Bioorg Med Chem Lett 18: 6402-5 (2008)
Article DOI: 10.1016/j.bmcl.2008.10.097
BindingDB Entry DOI: 10.7270/Q2542PGV
Beta-ketoacyl-[acyl-carrier-protein] synthase III
(Plasmodium falciparum)
BDBM50245928
(2-tosylnaphthalene-1,4-dione | CHEMBL454282)
Show SMILES Cc1ccc(cc1)S(=O)(=O)C1=CC(=O)c2ccccc2C1=O |t:11|
Show InChI InChI=1S/C17H12O4S/c1-11-6-8-12(9-7-11)22(20,21)16-10-15(18)13-4-2-3-5-14(13)17(16)19/h2-10H,1H3
n/an/a 1.43E+3n/an/an/an/an/an/a
Portland State University
Curated by ChEMBL
Assay Description
Inhibition of Plasmodium falciparum FabH
Bioorg Med Chem Lett 18: 6402-5 (2008)
Article DOI: 10.1016/j.bmcl.2008.10.097
BindingDB Entry DOI: 10.7270/Q2542PGV