BDBM50246139 5-(4-(pyridin-2-ylmethylamino)-5-(trifluoromethyl)pyrimidin-2-ylamino)indolin-2-one::CHEMBL471357
SMILES: FC(F)(F)c1cnc(Nc2ccc3NC(=O)Cc3c2)nc1NCc1ccccn1
InChI Key: InChIKey=DAJMEJBPGNBYEH-UHFFFAOYSA-N
Data: 2 IC50
Activity Spreadsheet -- Enzyme Inhibition Constant Data from BindingDB
Found 2 hits for monomerid = 50246139
Trg + Lig
Ki
nM
ΔG°
kcal/mole
IC50
nM
Kd
nM
EC50/IC50
nM
koff
s-1
kon
M-1s-1
pHTemp
°C
PTK2B protein tyrosine kinase 2 beta (PTK2B)
(Homo sapiens (Human))
BDBM50246139
(5-(4-(pyridin-2-ylmethylamino)-5-(trifluoromethyl)...)
Show SMILES FC(F)(F)c1cnc(Nc2ccc3NC(=O)Cc3c2)nc1NCc1ccccn1
Show InChI InChI=1S/C19H15F3N6O/c20-19(21,22)14-10-25-18(28-17(14)24-9-13-3-1-2-6-23-13)26-12-4-5-15-11(7-12)8-16(29)27-15/h1-7,10H,8-9H2,(H,27,29)(H2,24,25,26,28)
n/an/a 680n/an/an/an/an/an/a
Pfizer Global Research and Development
Curated by ChEMBL
Assay Description
Inhibition of GST-tagged pyk2 (unknown origin) assessed as inhibition of poly-Glu-Tyr phosphorylation
Bioorg Med Chem Lett 18: 6071-7 (2008)
Article DOI: 10.1016/j.bmcl.2008.10.030
BindingDB Entry DOI: 10.7270/Q2C8295H
Focal adhesion kinase 1
(Homo sapiens (Human))
BDBM50246139
(5-(4-(pyridin-2-ylmethylamino)-5-(trifluoromethyl)...)
Show SMILES FC(F)(F)c1cnc(Nc2ccc3NC(=O)Cc3c2)nc1NCc1ccccn1
Show InChI InChI=1S/C19H15F3N6O/c20-19(21,22)14-10-25-18(28-17(14)24-9-13-3-1-2-6-23-13)26-12-4-5-15-11(7-12)8-16(29)27-15/h1-7,10H,8-9H2,(H,27,29)(H2,24,25,26,28)
NCI pathway
Reactome pathway
n/an/a 19n/an/an/an/an/an/a
Pfizer Global Research and Development
Curated by ChEMBL
Assay Description
Inhibition of GST-tagged FAK (unknown origin) assessed as inhibition of poly-Glu-Tyr phosphorylation
Bioorg Med Chem Lett 18: 6071-7 (2008)
Article DOI: 10.1016/j.bmcl.2008.10.030
BindingDB Entry DOI: 10.7270/Q2C8295H