BDBM50246283 7-(4-((1R,2R)-2-(dimethylamino)cyclopentylamino)-5-(trifluoromethyl)pyrimidin-2-ylamino)-2,3,4,5-tetrahydrobenzo[c]azepin-1-one::CHEMBL518905
SMILES: CN(C)[C@@H]1CCC[C@H]1Nc1nc(Nc2ccc3c(CCCNC3=O)c2)ncc1C(F)(F)F
InChI Key: InChIKey=HZHMSBKFDZWRLC-QZTJIDSGSA-N
Data: 2 IC50
Activity Spreadsheet -- Enzyme Inhibition Constant Data from BindingDB
Found 2 hits for monomerid = 50246283
Trg + Lig
Ki
nM
ΔG°
kcal/mole
IC50
nM
Kd
nM
EC50/IC50
nM
koff
s-1
kon
M-1s-1
pHTemp
°C
PTK2B protein tyrosine kinase 2 beta (PTK2B)
(Homo sapiens (Human))
BDBM50246283
(7-(4-((1R,2R)-2-(dimethylamino)cyclopentylamino)-5...)
Show SMILES CN(C)[C@@H]1CCC[C@H]1Nc1nc(Nc2ccc3c(CCCNC3=O)c2)ncc1C(F)(F)F |r|
Show InChI InChI=1S/C22H27F3N6O/c1-31(2)18-7-3-6-17(18)29-19-16(22(23,24)25)12-27-21(30-19)28-14-8-9-15-13(11-14)5-4-10-26-20(15)32/h8-9,11-12,17-18H,3-7,10H2,1-2H3,(H,26,32)(H2,27,28,29,30)/t17-,18-/m1/s1
n/an/a 143n/an/an/an/an/an/a
Pfizer Global Research and Development
Curated by ChEMBL
Assay Description
Inhibition of GST-tagged pyk2 (unknown origin) assessed as inhibition of poly-Glu-Tyr phosphorylation
Bioorg Med Chem Lett 18: 6071-7 (2008)
Article DOI: 10.1016/j.bmcl.2008.10.030
BindingDB Entry DOI: 10.7270/Q2C8295H
Focal adhesion kinase 1
(Homo sapiens (Human))
BDBM50246283
(7-(4-((1R,2R)-2-(dimethylamino)cyclopentylamino)-5...)
Show SMILES CN(C)[C@@H]1CCC[C@H]1Nc1nc(Nc2ccc3c(CCCNC3=O)c2)ncc1C(F)(F)F |r|
Show InChI InChI=1S/C22H27F3N6O/c1-31(2)18-7-3-6-17(18)29-19-16(22(23,24)25)12-27-21(30-19)28-14-8-9-15-13(11-14)5-4-10-26-20(15)32/h8-9,11-12,17-18H,3-7,10H2,1-2H3,(H,26,32)(H2,27,28,29,30)/t17-,18-/m1/s1
NCI pathway
Reactome pathway
n/an/a 880n/an/an/an/an/an/a
Pfizer Global Research and Development
Curated by ChEMBL
Assay Description
Inhibition of GST-tagged FAK (unknown origin) assessed as inhibition of poly-Glu-Tyr phosphorylation
Bioorg Med Chem Lett 18: 6071-7 (2008)
Article DOI: 10.1016/j.bmcl.2008.10.030
BindingDB Entry DOI: 10.7270/Q2C8295H