BDBM50246301 4-(4-(1-cyclopentyl-2-methyl-1H-imidazol-5-yl)pyrimidin-2-ylamino)-N-methylbenzamide::CHEMBL488257
SMILES: CNC(=O)c1ccc(Nc2nccc(n2)-c2cnc(C)n2C2CCCC2)cc1
InChI Key: InChIKey=FRMUVPUWSPBSID-UHFFFAOYSA-N
Data: 1 IC50
Activity Spreadsheet -- Enzyme Inhibition Constant Data from BindingDB
Found 1 hit for monomerid = 50246301
Trg + Lig
Ki
nM
ΔG°
kcal/mole
IC50
nM
Kd
nM
EC50/IC50
nM
koff
s-1
kon
M-1s-1
pHTemp
°C
Cyclin-dependent kinase 2
(Homo sapiens (Human))
BDBM50246301
(4-(4-(1-cyclopentyl-2-methyl-1H-imidazol-5-yl)pyri...)
Show SMILES CNC(=O)c1ccc(Nc2nccc(n2)-c2cnc(C)n2C2CCCC2)cc1
Show InChI InChI=1S/C21H24N6O/c1-14-24-13-19(27(14)17-5-3-4-6-17)18-11-12-23-21(26-18)25-16-9-7-15(8-10-16)20(28)22-2/h7-13,17H,3-6H2,1-2H3,(H,22,28)(H,23,25,26)
NCI pathway
Reactome pathway
n/an/a 2n/an/an/an/an/an/a
AstraZeneca Pharmaceuticals
Curated by ChEMBL
Assay Description
Inhibition of CDK2 (unknown origin)
Bioorg Med Chem Lett 18: 6486-9 (2008)
Article DOI: 10.1016/j.bmcl.2008.10.075
BindingDB Entry DOI: 10.7270/Q23N2377