BDBM50246328 4-(4-((1R,2R)-2-(dimethylamino)cyclopentylamino)-5-(trifluoromethyl)pyrimidin-2-ylamino)-N,N-diethylbenzamide::CHEMBL455677
SMILES: CCN(CC)C(=O)c1ccc(Nc2ncc(c(N[C@@H]3CCC[C@H]3N(C)C)n2)C(F)(F)F)cc1
InChI Key: InChIKey=LXSACJAINAFXRF-RTBURBONSA-N
Data: 1 IC50
Activity Spreadsheet -- Enzyme Inhibition Constant Data from BindingDB
Found 1 hit for monomerid = 50246328
Trg + Lig
Ki
nM
ΔG°
kcal/mole
IC50
nM
Kd
nM
EC50/IC50
nM
koff
s-1
kon
M-1s-1
pHTemp
°C
Focal adhesion kinase 1
(Homo sapiens (Human))
BDBM50246328
(4-(4-((1R,2R)-2-(dimethylamino)cyclopentylamino)-5...)
Show SMILES CCN(CC)C(=O)c1ccc(Nc2ncc(c(N[C@@H]3CCC[C@H]3N(C)C)n2)C(F)(F)F)cc1 |r|
Show InChI InChI=1S/C23H31F3N6O/c1-5-32(6-2)21(33)15-10-12-16(13-11-15)28-22-27-14-17(23(24,25)26)20(30-22)29-18-8-7-9-19(18)31(3)4/h10-14,18-19H,5-9H2,1-4H3,(H2,27,28,29,30)/t18-,19-/m1/s1
NCI pathway
Reactome pathway
n/an/a 3.30E+3n/an/an/an/an/an/a
Pfizer Global Research and Development
Curated by ChEMBL
Assay Description
Inhibition of GST-tagged FAK (unknown origin) assessed as inhibition of poly-Glu-Tyr phosphorylation
Bioorg Med Chem Lett 18: 6071-7 (2008)
Article DOI: 10.1016/j.bmcl.2008.10.030
BindingDB Entry DOI: 10.7270/Q2C8295H