BDBM50246368 (R)-4-(3-(2-(3-methyl-2,5-dioxo-1',3'-dihydrospiro[imidazolidine-4,2'-indene]-5'-ylamino)-2-oxoethyl)-2-oxo-2,3-dihydro-1H-benzo[d]imidazol-1-yl)butanamide::CHEMBL508016
SMILES: CN1C(=O)NC(=O)[C@]11Cc2ccc(NC(=O)Cn3c4ccccc4n(CCCC(N)=O)c3=O)cc2C1
InChI Key: InChIKey=MWPKUIJGIOKDBJ-RUZDIDTESA-N
Data: 1 KI  2 IC50
Activity Spreadsheet -- Enzyme Inhibition Constant Data from BindingDB
Found 3 hits for monomerid = 50246368
Trg + Lig
Ki
nM
ΔG°
kcal/mole
IC50
nM
Kd
nM
EC50/IC50
nM
koff
s-1
kon
M-1s-1
pHTemp
°C
Calcitonin gene-related peptide type 1 receptor
(Homo sapiens (Human))
BDBM50246368
((R)-4-(3-(2-(3-methyl-2,5-dioxo-1',3'-dihydrospiro...)
Show SMILES CN1C(=O)NC(=O)[C@]11Cc2ccc(NC(=O)Cn3c4ccccc4n(CCCC(N)=O)c3=O)cc2C1 |r|
Show InChI InChI=1S/C25H26N6O5/c1-29-23(35)28-22(34)25(29)12-15-8-9-17(11-16(15)13-25)27-21(33)14-31-19-6-3-2-5-18(19)30(24(31)36)10-4-7-20(26)32/h2-3,5-6,8-9,11H,4,7,10,12-14H2,1H3,(H2,26,32)(H,27,33)(H,28,34,35)/t25-/m1/s1
Reactome pathway
13n/an/an/an/an/an/an/an/a
Merck & Co.
Curated by ChEMBL
Assay Description
Displacement of [125I]hCGRP from human cloned CGRP receptor expressed in HEK93 cells
Bioorg Med Chem Lett 18: 6122-5 (2008)
Article DOI: 10.1016/j.bmcl.2008.10.019
BindingDB Entry DOI: 10.7270/Q24Q7TTF
Calcitonin gene-related peptide type 1 receptor
(Homo sapiens (Human))
BDBM50246368
((R)-4-(3-(2-(3-methyl-2,5-dioxo-1',3'-dihydrospiro...)
Show SMILES CN1C(=O)NC(=O)[C@]11Cc2ccc(NC(=O)Cn3c4ccccc4n(CCCC(N)=O)c3=O)cc2C1 |r|
Show InChI InChI=1S/C25H26N6O5/c1-29-23(35)28-22(34)25(29)12-15-8-9-17(11-16(15)13-25)27-21(33)14-31-19-6-3-2-5-18(19)30(24(31)36)10-4-7-20(26)32/h2-3,5-6,8-9,11H,4,7,10,12-14H2,1H3,(H2,26,32)(H,27,33)(H,28,34,35)/t25-/m1/s1
Reactome pathway
n/an/a 43n/an/an/an/an/an/a
Merck & Co.
Curated by ChEMBL
Assay Description
Antagonist activity against human cloned CGRP receptor expressed in HEK93 cells assessed as inhibition of CGRP-induced cAMP production
Bioorg Med Chem Lett 18: 6122-5 (2008)
Article DOI: 10.1016/j.bmcl.2008.10.019
BindingDB Entry DOI: 10.7270/Q24Q7TTF
Calcitonin gene-related peptide type 1 receptor
(Homo sapiens (Human))
BDBM50246368
((R)-4-(3-(2-(3-methyl-2,5-dioxo-1',3'-dihydrospiro...)
Show SMILES CN1C(=O)NC(=O)[C@]11Cc2ccc(NC(=O)Cn3c4ccccc4n(CCCC(N)=O)c3=O)cc2C1 |r|
Show InChI InChI=1S/C25H26N6O5/c1-29-23(35)28-22(34)25(29)12-15-8-9-17(11-16(15)13-25)27-21(33)14-31-19-6-3-2-5-18(19)30(24(31)36)10-4-7-20(26)32/h2-3,5-6,8-9,11H,4,7,10,12-14H2,1H3,(H2,26,32)(H,27,33)(H,28,34,35)/t25-/m1/s1
Reactome pathway
n/an/a 76n/an/an/an/an/an/a
Merck & Co.
Curated by ChEMBL
Assay Description
Antagonist activity against human cloned CGRP receptor expressed in HEK93 cells assessed as inhibition of CGRP-induced cAMP production in presence of...
Bioorg Med Chem Lett 18: 6122-5 (2008)
Article DOI: 10.1016/j.bmcl.2008.10.019
BindingDB Entry DOI: 10.7270/Q24Q7TTF