BDBM50246424 2-{2,10-dioxo-1,3,9-triazatricyclo[6.5.1.0^{4,14}]tetradeca-4(14),5,7-trien-3-yl}-N-[(4R)-3-methyl-2,5-dioxo-1',3'-dihydrospiro[imidazolidine-4,2'-indene]-6'-yl]acetamide::CHEMBL455674
SMILES: CN1C(=O)NC(=O)[C@]11Cc2ccc(NC(=O)Cn3c4cccc5NC(=O)CCCn(c45)c3=O)cc2C1
InChI Key: InChIKey=KEAKEOFPVQMZEM-RUZDIDTESA-N
Data: 1 KI  2 IC50
Activity Spreadsheet -- Enzyme Inhibition Constant Data from BindingDB
Found 3 hits for monomerid = 50246424
Trg + Lig
Ki
nM
ΔG°
kcal/mole
IC50
nM
Kd
nM
EC50/IC50
nM
koff
s-1
kon
M-1s-1
pHTemp
°C
Calcitonin gene-related peptide type 1 receptor
(Homo sapiens (Human))
BDBM50246424
(2-{2,10-dioxo-1,3,9-triazatricyclo[6.5.1.0^{4,14}]...)
Show SMILES CN1C(=O)NC(=O)[C@]11Cc2ccc(NC(=O)Cn3c4cccc5NC(=O)CCCn(c45)c3=O)cc2C1 |r|
Show InChI InChI=1S/C25H24N6O5/c1-29-23(35)28-22(34)25(29)11-14-7-8-16(10-15(14)12-25)26-20(33)13-31-18-5-2-4-17-21(18)30(24(31)36)9-3-6-19(32)27-17/h2,4-5,7-8,10H,3,6,9,11-13H2,1H3,(H,26,33)(H,27,32)(H,28,34,35)/t25-/m1/s1
Reactome pathway
4.70n/an/an/an/an/an/an/an/a
Merck & Co.
Curated by ChEMBL
Assay Description
Displacement of [125I]hCGRP from human cloned CGRP receptor expressed in HEK93 cells
Bioorg Med Chem Lett 18: 6122-5 (2008)
Article DOI: 10.1016/j.bmcl.2008.10.019
BindingDB Entry DOI: 10.7270/Q24Q7TTF
Calcitonin gene-related peptide type 1 receptor
(Homo sapiens (Human))
BDBM50246424
(2-{2,10-dioxo-1,3,9-triazatricyclo[6.5.1.0^{4,14}]...)
Show SMILES CN1C(=O)NC(=O)[C@]11Cc2ccc(NC(=O)Cn3c4cccc5NC(=O)CCCn(c45)c3=O)cc2C1 |r|
Show InChI InChI=1S/C25H24N6O5/c1-29-23(35)28-22(34)25(29)11-14-7-8-16(10-15(14)12-25)26-20(33)13-31-18-5-2-4-17-21(18)30(24(31)36)9-3-6-19(32)27-17/h2,4-5,7-8,10H,3,6,9,11-13H2,1H3,(H,26,33)(H,27,32)(H,28,34,35)/t25-/m1/s1
Reactome pathway
n/an/a 14n/an/an/an/an/an/a
Merck & Co.
Curated by ChEMBL
Assay Description
Antagonist activity against human cloned CGRP receptor expressed in HEK93 cells assessed as inhibition of CGRP-induced cAMP production
Bioorg Med Chem Lett 18: 6122-5 (2008)
Article DOI: 10.1016/j.bmcl.2008.10.019
BindingDB Entry DOI: 10.7270/Q24Q7TTF
Calcitonin gene-related peptide type 1 receptor
(Homo sapiens (Human))
BDBM50246424
(2-{2,10-dioxo-1,3,9-triazatricyclo[6.5.1.0^{4,14}]...)
Show SMILES CN1C(=O)NC(=O)[C@]11Cc2ccc(NC(=O)Cn3c4cccc5NC(=O)CCCn(c45)c3=O)cc2C1 |r|
Show InChI InChI=1S/C25H24N6O5/c1-29-23(35)28-22(34)25(29)11-14-7-8-16(10-15(14)12-25)26-20(33)13-31-18-5-2-4-17-21(18)30(24(31)36)9-3-6-19(32)27-17/h2,4-5,7-8,10H,3,6,9,11-13H2,1H3,(H,26,33)(H,27,32)(H,28,34,35)/t25-/m1/s1
Reactome pathway
n/an/a 21n/an/an/an/an/an/a
Merck & Co.
Curated by ChEMBL
Assay Description
Antagonist activity against human cloned CGRP receptor expressed in HEK93 cells assessed as inhibition of CGRP-induced cAMP production in presence of...
Bioorg Med Chem Lett 18: 6122-5 (2008)
Article DOI: 10.1016/j.bmcl.2008.10.019
BindingDB Entry DOI: 10.7270/Q24Q7TTF