BDBM50246572 4-(4-hydroxyphenyl)-2,3-bis(2-methoxyethylidene)-1-methyl-2,3-dihydro-1H-pyrrolo[2,3-c]pyridin-7(6H)-one::CHEMBL461340
SMILES: COc1cc2n(C)c3c(c(c[nH]c3=O)-c3ccc(O)cc3)c2cc1OC
InChI Key: InChIKey=JIYDBXONPAAZPB-UHFFFAOYSA-N
Data: 1 IC50
Activity Spreadsheet -- Enzyme Inhibition Constant Data from BindingDB
Found 1 hit for monomerid = 50246572
Trg + Lig
Ki
nM
ΔG°
kcal/mole
IC50
nM
Kd
nM
EC50/IC50
nM
koff
s-1
kon
M-1s-1
pHTemp
°C
Proto-oncogene tyrosine-protein kinase receptor Ret
(Homo sapiens (Human))
BDBM50246572
(4-(4-hydroxyphenyl)-2,3-bis(2-methoxyethylidene)-1...)
Show SMILES COc1cc2n(C)c3c(c(c[nH]c3=O)-c3ccc(O)cc3)c2cc1OC
Show InChI InChI=1S/C20H18N2O4/c1-22-15-9-17(26-3)16(25-2)8-13(15)18-14(10-21-20(24)19(18)22)11-4-6-12(23)7-5-11/h4-10,23H,1-3H3,(H,21,24)
n/an/a 60n/an/an/an/an/an/a
Universita di Milano
Curated by ChEMBL
Assay Description
Inhibition of recombinant RET active protein (unknown origin) by immunoblotting
J Med Chem 51: 7777-87 (2008)
Article DOI: 10.1021/jm8007823
BindingDB Entry DOI: 10.7270/Q2DN44X5