BDBM50246580 (S)-2-((4aS,6aS,6bR,8aR,10S,12aR,12bR,14bS)-10-hydroxy-2,2,6a,6b,9,9,12a-heptamethyl-1,2,3,4,4a,5,6,6a,6b,7,8,8a,9,10,11,12,12a,12b,13,14b-icosahydropicene-4a-carboxamido)-3-phenylpropanoic acid::CHEMBL449613
SMILES: CC1(C)CC[C@@]2(CC[C@]3(C)C(=CC[C@@H]4[C@@]5(C)CC[C@H](O)C(C)(C)[C@@H]5CC[C@@]34C)[C@@H]2C1)C(=O)N[C@@H](Cc1ccccc1)C(O)=O
InChI Key: InChIKey=FYVHPADZKHBHBV-KCBOUSQHSA-N
Data: 5 IC50
Activity Spreadsheet -- Enzyme Inhibition Constant Data from BindingDB
Found 5 hits for monomerid = 50246580
Trg + Lig
Ki
nM
ΔG°
kcal/mole
IC50
nM
Kd
nM
EC50/IC50
nM
koff
s-1
kon
M-1s-1
pHTemp
°C
Protein-tyrosine phosphatase 1C
(Homo sapiens (Human))
BDBM50246580
((S)-2-((4aS,6aS,6bR,8aR,10S,12aR,12bR,14bS)-10-hyd...)
Show SMILES CC1(C)CC[C@@]2(CC[C@]3(C)C(=CC[C@@H]4[C@@]5(C)CC[C@H](O)C(C)(C)[C@@H]5CC[C@@]34C)[C@@H]2C1)C(=O)N[C@@H](Cc1ccccc1)C(O)=O |r,c:10|
Show InChI InChI=1S/C39H57NO4/c1-34(2)19-21-39(33(44)40-28(32(42)43)23-25-11-9-8-10-12-25)22-20-37(6)26(27(39)24-34)13-14-30-36(5)17-16-31(41)35(3,4)29(36)15-18-38(30,37)7/h8-13,27-31,41H,14-24H2,1-7H3,(H,40,44)(H,42,43)/t27-,28-,29-,30+,31-,36-,37+,38+,39-/m0/s1
Reactome pathway
n/an/a 1.26E+4n/an/an/an/an/an/a
Chinese Academy of Sciences
Curated by ChEMBL
Assay Description
Inhibition of human recombinant SHP1
Bioorg Med Chem 16: 8697-705 (2008)
Article DOI: 10.1016/j.bmc.2008.07.080
BindingDB Entry DOI: 10.7270/Q2HX1CH7
Receptor-type tyrosine-protein phosphatase F (LAR)
(Homo sapiens (Human))
BDBM50246580
((S)-2-((4aS,6aS,6bR,8aR,10S,12aR,12bR,14bS)-10-hyd...)
Show SMILES CC1(C)CC[C@@]2(CC[C@]3(C)C(=CC[C@@H]4[C@@]5(C)CC[C@H](O)C(C)(C)[C@@H]5CC[C@@]34C)[C@@H]2C1)C(=O)N[C@@H](Cc1ccccc1)C(O)=O |r,c:10|
Show InChI InChI=1S/C39H57NO4/c1-34(2)19-21-39(33(44)40-28(32(42)43)23-25-11-9-8-10-12-25)22-20-37(6)26(27(39)24-34)13-14-30-36(5)17-16-31(41)35(3,4)29(36)15-18-38(30,37)7/h8-13,27-31,41H,14-24H2,1-7H3,(H,40,44)(H,42,43)/t27-,28-,29-,30+,31-,36-,37+,38+,39-/m0/s1
n/an/a>4.00E+4n/an/an/an/an/an/a
Chinese Academy of Sciences
Curated by ChEMBL
Assay Description
Inhibition of human recombinant LAR
Bioorg Med Chem 16: 8697-705 (2008)
Article DOI: 10.1016/j.bmc.2008.07.080
BindingDB Entry DOI: 10.7270/Q2HX1CH7
Protein-tyrosine phosphatase 1B
(Homo sapiens (Human))
BDBM50246580
((S)-2-((4aS,6aS,6bR,8aR,10S,12aR,12bR,14bS)-10-hyd...)
Show SMILES CC1(C)CC[C@@]2(CC[C@]3(C)C(=CC[C@@H]4[C@@]5(C)CC[C@H](O)C(C)(C)[C@@H]5CC[C@@]34C)[C@@H]2C1)C(=O)N[C@@H](Cc1ccccc1)C(O)=O |r,c:10|
Show InChI InChI=1S/C39H57NO4/c1-34(2)19-21-39(33(44)40-28(32(42)43)23-25-11-9-8-10-12-25)22-20-37(6)26(27(39)24-34)13-14-30-36(5)17-16-31(41)35(3,4)29(36)15-18-38(30,37)7/h8-13,27-31,41H,14-24H2,1-7H3,(H,40,44)(H,42,43)/t27-,28-,29-,30+,31-,36-,37+,38+,39-/m0/s1
NCI pathway
Reactome pathway
n/an/a 3.31E+3n/an/an/an/an/an/a
Chinese Academy of Sciences
Curated by ChEMBL
Assay Description
Inhibition of PTP1B (unknown origin) by pNPP assay
Bioorg Med Chem 16: 8697-705 (2008)
Article DOI: 10.1016/j.bmc.2008.07.080
BindingDB Entry DOI: 10.7270/Q2HX1CH7
Receptor-type tyrosine-protein phosphatase epsilon (PTPε)
(Homo sapiens (Human))
BDBM50246580
((S)-2-((4aS,6aS,6bR,8aR,10S,12aR,12bR,14bS)-10-hyd...)
Show SMILES CC1(C)CC[C@@]2(CC[C@]3(C)C(=CC[C@@H]4[C@@]5(C)CC[C@H](O)C(C)(C)[C@@H]5CC[C@@]34C)[C@@H]2C1)C(=O)N[C@@H](Cc1ccccc1)C(O)=O |r,c:10|
Show InChI InChI=1S/C39H57NO4/c1-34(2)19-21-39(33(44)40-28(32(42)43)23-25-11-9-8-10-12-25)22-20-37(6)26(27(39)24-34)13-14-30-36(5)17-16-31(41)35(3,4)29(36)15-18-38(30,37)7/h8-13,27-31,41H,14-24H2,1-7H3,(H,40,44)(H,42,43)/t27-,28-,29-,30+,31-,36-,37+,38+,39-/m0/s1
n/an/a>4.00E+4n/an/an/an/an/an/a
Chinese Academy of Sciences
Curated by ChEMBL
Assay Description
Inhibition of human recombinant PTPepsilon
Bioorg Med Chem 16: 8697-705 (2008)
Article DOI: 10.1016/j.bmc.2008.07.080
BindingDB Entry DOI: 10.7270/Q2HX1CH7
Protein-tyrosine phosphatase alpha
(Homo sapiens (Human))
BDBM50246580
((S)-2-((4aS,6aS,6bR,8aR,10S,12aR,12bR,14bS)-10-hyd...)
Show SMILES CC1(C)CC[C@@]2(CC[C@]3(C)C(=CC[C@@H]4[C@@]5(C)CC[C@H](O)C(C)(C)[C@@H]5CC[C@@]34C)[C@@H]2C1)C(=O)N[C@@H](Cc1ccccc1)C(O)=O |r,c:10|
Show InChI InChI=1S/C39H57NO4/c1-34(2)19-21-39(33(44)40-28(32(42)43)23-25-11-9-8-10-12-25)22-20-37(6)26(27(39)24-34)13-14-30-36(5)17-16-31(41)35(3,4)29(36)15-18-38(30,37)7/h8-13,27-31,41H,14-24H2,1-7H3,(H,40,44)(H,42,43)/t27-,28-,29-,30+,31-,36-,37+,38+,39-/m0/s1
n/an/a>4.00E+4n/an/an/an/an/an/a
Chinese Academy of Sciences
Curated by ChEMBL
Assay Description
Inhibition of human recombinant PTPalpha
Bioorg Med Chem 16: 8697-705 (2008)
Article DOI: 10.1016/j.bmc.2008.07.080
BindingDB Entry DOI: 10.7270/Q2HX1CH7