BDBM50246619 (4aS,6aS,6bR,8aR,10S,12aR,12bR,14bS)-benzyl 10-hydroxy-2,2,6a,6b,9,9,12a-heptamethyl-1,2,3,4,4a,5,6,6a,6b,7,8,8a,9,10,11,12,12a,12b,13,14b-icosahydropicene-4a-carboxylate::CHEMBL445301::benzyl (4aS,6aS,6bR,8aR,10S,12aR,12bR,14bS)-10- hydroxy-2,2,6a,6b,9,9,12a-heptamethyl- 1,3,4,5,6,7,8,8a,10,11,12,12b,13,14b- tetradecahydropicene-4a-carboxylate (Compound 4)
SMILES: CC1(C)CC[C@@]2(CC[C@]3(C)C(=CC[C@@H]4[C@@]5(C)CC[C@H](O)C(C)(C)[C@@H]5CC[C@@]34C)[C@@H]2C1)C(=O)OCc1ccccc1
InChI Key: InChIKey=BXPBVHNXTDZAAM-GBVPUKILSA-N
Data: 5 IC50
Activity Spreadsheet -- Enzyme Inhibition Constant Data from BindingDB
Found 5 hits for monomerid = 50246619
Trg + Lig
Ki
nM
ΔG°
kcal/mole
IC50
nM
Kd
nM
EC50/IC50
nM
koff
s-1
kon
M-1s-1
pHTemp
°C
Glycogen phosphorylase, muscle form
(Oryctolagus cuniculus (rabbit))
BDBM50246619
((4aS,6aS,6bR,8aR,10S,12aR,12bR,14bS)-benzyl 10-hyd...)
Show SMILES CC1(C)CC[C@@]2(CC[C@]3(C)C(=CC[C@@H]4[C@@]5(C)CC[C@H](O)C(C)(C)[C@@H]5CC[C@@]34C)[C@@H]2C1)C(=O)OCc1ccccc1 |r,c:10|
Show InChI InChI=1S/C37H54O3/c1-32(2)19-21-37(31(39)40-24-25-11-9-8-10-12-25)22-20-35(6)26(27(37)23-32)13-14-29-34(5)17-16-30(38)33(3,4)28(34)15-18-36(29,35)7/h8-13,27-30,38H,14-24H2,1-7H3/t27-,28-,29+,30-,34-,35+,36+,37-/m0/s1
n/an/a 4.61E+5n/an/an/an/a7.222
Institute of Traditional Chinese Medicine, Chengde Medical University, Chengde, 067000, China
Assay Description
Rabbit muscle glycogen phosphorylase a (RMGPa) activity was measured by the release of phosphate from glucose-1-phosphate at 655 nm. Each compound wa...
Chem Biol Drug Des 83: 297-305 (2014)
Article DOI: 10.1111/cbdd.12241
BindingDB Entry DOI: 10.7270/Q2TH8KBS
Protein-tyrosine phosphatase 1B
(Homo sapiens (Human))
BDBM50246619
((4aS,6aS,6bR,8aR,10S,12aR,12bR,14bS)-benzyl 10-hyd...)
Show SMILES CC1(C)CC[C@@]2(CC[C@]3(C)C(=CC[C@@H]4[C@@]5(C)CC[C@H](O)C(C)(C)[C@@H]5CC[C@@]34C)[C@@H]2C1)C(=O)OCc1ccccc1 |r,c:10|
Show InChI InChI=1S/C37H54O3/c1-32(2)19-21-37(31(39)40-24-25-11-9-8-10-12-25)22-20-35(6)26(27(37)23-32)13-14-29-34(5)17-16-30(38)33(3,4)28(34)15-18-36(29,35)7/h8-13,27-30,38H,14-24H2,1-7H3/t27-,28-,29+,30-,34-,35+,36+,37-/m0/s1
NCI pathway
Reactome pathway
n/an/a 8.61E+3n/an/an/an/an/an/a
Chinese Academy of Sciences
Curated by ChEMBL
Assay Description
Inhibition of PTP1B (unknown origin) by pNPP assay
Bioorg Med Chem 16: 8697-705 (2008)
Article DOI: 10.1016/j.bmc.2008.07.080
BindingDB Entry DOI: 10.7270/Q2HX1CH7
Protein-tyrosine phosphatase 1B
(Homo sapiens (Human))
BDBM50246619
((4aS,6aS,6bR,8aR,10S,12aR,12bR,14bS)-benzyl 10-hyd...)
Show SMILES CC1(C)CC[C@@]2(CC[C@]3(C)C(=CC[C@@H]4[C@@]5(C)CC[C@H](O)C(C)(C)[C@@H]5CC[C@@]34C)[C@@H]2C1)C(=O)OCc1ccccc1 |r,c:10|
Show InChI InChI=1S/C37H54O3/c1-32(2)19-21-37(31(39)40-24-25-11-9-8-10-12-25)22-20-35(6)26(27(37)23-32)13-14-29-34(5)17-16-30(38)33(3,4)28(34)15-18-36(29,35)7/h8-13,27-30,38H,14-24H2,1-7H3/t27-,28-,29+,30-,34-,35+,36+,37-/m0/s1
NCI pathway
Reactome pathway
n/an/a 8.61E+3n/an/an/an/an/an/a
TBA
Assay Description
Inhibition of PTP1B (unknown origin)
Citation and Details
Article DOI: 10.1007/s00044-010-9529-5
BindingDB Entry DOI: 10.7270/Q2F76GFZ
Protein-tyrosine phosphatase 1B
(Homo sapiens (Human))
BDBM50246619
((4aS,6aS,6bR,8aR,10S,12aR,12bR,14bS)-benzyl 10-hyd...)
Show SMILES CC1(C)CC[C@@]2(CC[C@]3(C)C(=CC[C@@H]4[C@@]5(C)CC[C@H](O)C(C)(C)[C@@H]5CC[C@@]34C)[C@@H]2C1)C(=O)OCc1ccccc1 |r,c:10|
Show InChI InChI=1S/C37H54O3/c1-32(2)19-21-37(31(39)40-24-25-11-9-8-10-12-25)22-20-35(6)26(27(37)23-32)13-14-29-34(5)17-16-30(38)33(3,4)28(34)15-18-36(29,35)7/h8-13,27-30,38H,14-24H2,1-7H3/t27-,28-,29+,30-,34-,35+,36+,37-/m0/s1
NCI pathway
Reactome pathway
n/an/a 8.61E+3n/an/an/an/an/an/a
TBA
Assay Description
Inhibition of PTP1B (unknown origin)
Citation and Details
Article DOI: 10.1007/s00044-010-9529-5
BindingDB Entry DOI: 10.7270/Q2F76GFZ
Coagulation factor VII/tissue factor
(Homo sapiens (Human))
BDBM50246619
((4aS,6aS,6bR,8aR,10S,12aR,12bR,14bS)-benzyl 10-hyd...)
Show SMILES CC1(C)CC[C@@]2(CC[C@]3(C)C(=CC[C@@H]4[C@@]5(C)CC[C@H](O)C(C)(C)[C@@H]5CC[C@@]34C)[C@@H]2C1)C(=O)OCc1ccccc1 |r,c:10|
Show InChI InChI=1S/C37H54O3/c1-32(2)19-21-37(31(39)40-24-25-11-9-8-10-12-25)22-20-35(6)26(27(37)23-32)13-14-29-34(5)17-16-30(38)33(3,4)28(34)15-18-36(29,35)7/h8-13,27-30,38H,14-24H2,1-7H3/t27-,28-,29+,30-,34-,35+,36+,37-/m0/s1
Reactome pathway
n/an/a 4.70n/an/an/an/an/an/a
China Pharmaceutical University
Curated by ChEMBL
Assay Description
Inhibition of LPS-induced tissue factor procoagulant activity in human THP1 cells preincubated for 1 hr followed by LPS addition measured after 5 hrs...
Bioorg Med Chem Lett 27: 1026-1030 (2017)
Article DOI: 10.1016/j.bmcl.2016.12.066
BindingDB Entry DOI: 10.7270/Q2B27XJD