BDBM50246640 CHEMBL4064668
SMILES: [O-]C=O.COc1ccc(F)c(CC[N+](C)(C)C)c1
InChI Key: InChIKey=HFWBDGCLOQKZOU-UHFFFAOYSA-N
Data: 3 KI  1 EC50
Activity Spreadsheet -- Enzyme Inhibition Constant Data from BindingDB
Found 4 hits for monomerid = 50246640
Trg + Lig
Ki
nM
ΔG°
kcal/mole
IC50
nM
Kd
nM
EC50/IC50
nM
koff
s-1
kon
M-1s-1
pHTemp
°C
Muscarinic acetylcholine receptor M2 and M4
(Homo sapiens (Human))
BDBM50246640
(CHEMBL4064668)
Show SMILES [O-]C=O.COc1ccc(F)c(CC[N+](C)(C)C)c1
Show InChI InChI=1S/C12H19FNO/c1-14(2,3)8-7-10-9-11(15-4)5-6-12(10)13/h5-6,9H,7-8H2,1-4H3/q+1
980n/an/an/an/an/an/an/an/a
University of California
Curated by ChEMBL
Assay Description
Displacement of [3H]N-methyl-scopolamine bromide from human recombinant muscarinic M2 receptor expressed in HEK293T cell membranes after 1 hr by liqu...
J Med Chem 60: 9239-9250 (2017)
Article DOI: 10.1021/acs.jmedchem.7b01113
BindingDB Entry DOI: 10.7270/Q2445PW2
Muscarinic acetylcholine receptor M1
(Homo sapiens (Human))
BDBM50246640
(CHEMBL4064668)
Show SMILES [O-]C=O.COc1ccc(F)c(CC[N+](C)(C)C)c1
Show InChI InChI=1S/C12H19FNO/c1-14(2,3)8-7-10-9-11(15-4)5-6-12(10)13/h5-6,9H,7-8H2,1-4H3/q+1
7.10E+3n/an/an/an/an/an/an/an/a
University of California
Curated by ChEMBL
Assay Description
Displacement of [3H]N-methyl-scopolamine bromide from human recombinant muscarinic M1 receptor expressed in HEK293T cell membranes after 1 hr by liqu...
J Med Chem 60: 9239-9250 (2017)
Article DOI: 10.1021/acs.jmedchem.7b01113
BindingDB Entry DOI: 10.7270/Q2445PW2
Muscarinic acetylcholine receptor M3
(Homo sapiens (Human))
BDBM50246640
(CHEMBL4064668)
Show SMILES [O-]C=O.COc1ccc(F)c(CC[N+](C)(C)C)c1
Show InChI InChI=1S/C12H19FNO/c1-14(2,3)8-7-10-9-11(15-4)5-6-12(10)13/h5-6,9H,7-8H2,1-4H3/q+1
Reactome pathway
1.40E+4n/an/an/an/an/an/an/an/a
University of California
Curated by ChEMBL
Assay Description
Displacement of [3H]N-methyl-scopolamine bromide from human recombinant muscarinic M3 receptor expressed in HEK293T cell membranes after 1 hr by liqu...
J Med Chem 60: 9239-9250 (2017)
Article DOI: 10.1021/acs.jmedchem.7b01113
BindingDB Entry DOI: 10.7270/Q2445PW2
Muscarinic acetylcholine receptor M2 and M4
(Homo sapiens (Human))
BDBM50246640
(CHEMBL4064668)
Show SMILES [O-]C=O.COc1ccc(F)c(CC[N+](C)(C)C)c1
Show InChI InChI=1S/C12H19FNO/c1-14(2,3)8-7-10-9-11(15-4)5-6-12(10)13/h5-6,9H,7-8H2,1-4H3/q+1
n/an/an/an/a 2.30E+4n/an/an/an/a
University of California
Curated by ChEMBL
Assay Description
Agonist activity at human recombinant muscarinic M2 receptor co-expressed with Galphaqi5-HA in African green monkey COS7 cells assessed as IP accumul...
J Med Chem 60: 9239-9250 (2017)
Article DOI: 10.1021/acs.jmedchem.7b01113
BindingDB Entry DOI: 10.7270/Q2445PW2