null
SMILES: COC(C1CCN(C)CC1)c1cc(Cl)c2CCN(Cc3c(C)cc(C)[nH]c3=O)C(=O)c2c1Cl
InChI Key: InChIKey=HBBYOXWWUDCWQZ-UHFFFAOYSA-N
Activity Spreadsheet -- Enzyme Inhibition Constant Data from BindingDB
Found 6 hits for monomerid = 50246940
Trg + Lig
Ki
nM
ΔG°
kcal/mole
IC50
nM
Kd
nM
EC50/IC50
nM
koff
s-1
kon
M-1s-1
pHTemp
°C
Histone-lysine N-methyltransferase EZH2
(Homo sapiens (Human))
BDBM50246940
(CHEMBL4071056 | US10570121, Example 137)
Show SMILES COC(C1CCN(C)CC1)c1cc(Cl)c2CCN(Cc3c(C)cc(C)[nH]c3=O)C(=O)c2c1Cl
Show InChI InChI=1S/C25H31Cl2N3O3/c1-14-11-15(2)28-24(31)19(14)13-30-10-7-17-20(26)12-18(22(27)21(17)25(30)32)23(33-4)16-5-8-29(3)9-6-16/h11-12,16,23H,5-10,13H2,1-4H3,(H,28,31)
US Patent
0.100n/an/an/an/an/an/an/an/a
Pfizer Inc.
US Patent
Assay Description
A. Compound preparation1. Prepare 10 mM stock solutions in 100% DMSO from solid material2. Serial dilute 10 mM compound stocks either 2 or 3-fold in ...
US Patent US10570121 (2020)
BindingDB Entry DOI: 10.7270/Q28W3GQD
Histone-lysine N-methyltransferase EZH2
(Homo sapiens (Human))
BDBM50246940
(CHEMBL4071056 | US10570121, Example 137)
Show SMILES COC(C1CCN(C)CC1)c1cc(Cl)c2CCN(Cc3c(C)cc(C)[nH]c3=O)C(=O)c2c1Cl
Show InChI InChI=1S/C25H31Cl2N3O3/c1-14-11-15(2)28-24(31)19(14)13-30-10-7-17-20(26)12-18(22(27)21(17)25(30)32)23(33-4)16-5-8-29(3)9-6-16/h11-12,16,23H,5-10,13H2,1-4H3,(H,28,31)
US Patent
133n/an/an/an/an/an/an/an/a
Pfizer Inc.
US Patent
Assay Description
A. Compound preparation1. Prepare 10 mM stock solutions in 100% DMSO from solid material2. Serial dilute 10 mM compound stocks either 2 or 3-fold in ...
US Patent US10570121 (2020)
BindingDB Entry DOI: 10.7270/Q28W3GQD
Histone-lysine N-methyltransferase EZH2
(Homo sapiens (Human))
BDBM50246940
(CHEMBL4071056 | US10570121, Example 137)
Show SMILES COC(C1CCN(C)CC1)c1cc(Cl)c2CCN(Cc3c(C)cc(C)[nH]c3=O)C(=O)c2c1Cl
Show InChI InChI=1S/C25H31Cl2N3O3/c1-14-11-15(2)28-24(31)19(14)13-30-10-7-17-20(26)12-18(22(27)21(17)25(30)32)23(33-4)16-5-8-29(3)9-6-16/h11-12,16,23H,5-10,13H2,1-4H3,(H,28,31)
n/an/a 1.13E+3n/an/an/an/an/an/a
WuXi AppTec
Curated by ChEMBL
Assay Description
Inhibition of EZH2 in human KARPAS422 cells assessed as reduction in H3K27me3 level after 72 hrs by ELISA
J Med Chem 61: 650-665 (2018)
Article DOI: 10.1021/acs.jmedchem.7b01375
BindingDB Entry DOI: 10.7270/Q2X069G8
Histone-lysine N-methyltransferase EZH2 [2-746,Y641N]
(Homo sapiens (Human))
BDBM50246940
(CHEMBL4071056 | US10570121, Example 137)
Show SMILES COC(C1CCN(C)CC1)c1cc(Cl)c2CCN(Cc3c(C)cc(C)[nH]c3=O)C(=O)c2c1Cl
Show InChI InChI=1S/C25H31Cl2N3O3/c1-14-11-15(2)28-24(31)19(14)13-30-10-7-17-20(26)12-18(22(27)21(17)25(30)32)23(33-4)16-5-8-29(3)9-6-16/h11-12,16,23H,5-10,13H2,1-4H3,(H,28,31)
NCI pathway
Reactome pathway
US Patent
n/an/a 1.17E+3n/an/an/an/an/an/a
Pfizer Inc.
US Patent
Assay Description
A. Compound preparation1. Prepare 10 mM stock solutions in 100% DMSO from solid material2. Serial dilute 10 mM compound stocks either 2 or 3-fold in ...
US Patent US10570121 (2020)
BindingDB Entry DOI: 10.7270/Q28W3GQD
Histone-lysine N-methyltransferase EZH2 [2-746,Y641N]
(Homo sapiens (Human))
BDBM50246940
(CHEMBL4071056 | US10570121, Example 137)
Show SMILES COC(C1CCN(C)CC1)c1cc(Cl)c2CCN(Cc3c(C)cc(C)[nH]c3=O)C(=O)c2c1Cl
Show InChI InChI=1S/C25H31Cl2N3O3/c1-14-11-15(2)28-24(31)19(14)13-30-10-7-17-20(26)12-18(22(27)21(17)25(30)32)23(33-4)16-5-8-29(3)9-6-16/h11-12,16,23H,5-10,13H2,1-4H3,(H,28,31)
NCI pathway
Reactome pathway
US Patent
n/an/a 3n/an/an/an/an/an/a
Pfizer Inc.
US Patent
Assay Description
A. Compound preparation1. Prepare 10 mM stock solutions in 100% DMSO from solid material2. Serial dilute 10 mM compound stocks either 2 or 3-fold in ...
US Patent US10570121 (2020)
BindingDB Entry DOI: 10.7270/Q28W3GQD
Histone-lysine N-methyltransferase EZH2
(Homo sapiens (Human))
BDBM50246940
(CHEMBL4071056 | US10570121, Example 137)
Show SMILES COC(C1CCN(C)CC1)c1cc(Cl)c2CCN(Cc3c(C)cc(C)[nH]c3=O)C(=O)c2c1Cl
Show InChI InChI=1S/C25H31Cl2N3O3/c1-14-11-15(2)28-24(31)19(14)13-30-10-7-17-20(26)12-18(22(27)21(17)25(30)32)23(33-4)16-5-8-29(3)9-6-16/h11-12,16,23H,5-10,13H2,1-4H3,(H,28,31)
n/an/a 9n/an/an/an/an/an/a
WuXi AppTec
Curated by ChEMBL
Assay Description
Inhibition of EZH2 in human KARPAS422 cells assessed as reduction in H3K27me3 level after 72 hrs by ELISA
J Med Chem 61: 650-665 (2018)
Article DOI: 10.1021/acs.jmedchem.7b01375
BindingDB Entry DOI: 10.7270/Q2X069G8