BDBM50247010 CHEMBL4068039
SMILES: Cl.Cl.CNCCN(CC1CCCN(C1)C1Cc2ccccc2C1)C(=O)c1ccc2ccccc2c1
InChI Key: InChIKey=JXEHCYYERMTHAV-UHFFFAOYSA-N
Data: 1 IC50
Activity Spreadsheet -- Enzyme Inhibition Constant Data from BindingDB
Found 1 hit for monomerid = 50247010
Trg + Lig
Ki
nM
ΔG°
kcal/mole
IC50
nM
Kd
nM
EC50/IC50
nM
koff
s-1
kon
M-1s-1
pHTemp
°C
Cholinesterase
(Homo sapiens (Human))
BDBM50247010
(CHEMBL4068039)
Show SMILES Cl.Cl.CNCCN(CC1CCCN(C1)C1Cc2ccccc2C1)C(=O)c1ccc2ccccc2c1
Show InChI InChI=1S/C29H35N3O.2ClH/c1-30-14-16-32(29(33)27-13-12-23-8-2-3-9-24(23)17-27)21-22-7-6-15-31(20-22)28-18-25-10-4-5-11-26(25)19-28;;/h2-5,8-13,17,22,28,30H,6-7,14-16,18-21H2,1H3;2*1H
Reactome pathway
n/an/a 18n/an/an/an/an/an/a
University of Ljubljana
Curated by ChEMBL
Assay Description
Inhibition of recombinant human BChE using butyrylthiocholine iodide as substrate preincubated for 300 secs followed by substrate addition measured f...
J Med Chem 61: 119-139 (2018)
Article DOI: 10.1021/acs.jmedchem.7b01086
BindingDB Entry DOI: 10.7270/Q2S75JRJ