BDBM50247107 CHEMBL460493::N-methyl-2-(7-phenylheptanoyl)oxazole-4-carboxamide
SMILES: CNC(=O)c1coc(n1)C(=O)CCCCCCc1ccccc1
InChI Key: InChIKey=ZSWXYDHKXMUUMO-UHFFFAOYSA-N
Data: 1 KI  1 IC50
Activity Spreadsheet -- Enzyme Inhibition Constant Data from BindingDB
Found 2 hits for monomerid = 50247107
Trg + Lig
Ki
nM
ΔG°
kcal/mole
IC50
nM
Kd
nM
EC50/IC50
nM
koff
s-1
kon
M-1s-1
pHTemp
°C
Fatty-acid amide hydrolase 1 (aa 30-579)
(Rattus norvegicus (rat))
BDBM50247107
(CHEMBL460493 | N-methyl-2-(7-phenylheptanoyl)oxazo...)
Show SMILES CNC(=O)c1coc(n1)C(=O)CCCCCCc1ccccc1
Show InChI InChI=1S/C18H22N2O3/c1-19-17(22)15-13-23-18(20-15)16(21)12-8-3-2-5-9-14-10-6-4-7-11-14/h4,6-7,10-11,13H,2-3,5,8-9,12H2,1H3,(H,19,22)
1.80n/an/an/an/an/an/an/an/a
The Scripps Research Institute
Curated by ChEMBL
Assay Description
Inhibition of rat FAAH
Bioorg Med Chem Lett 18: 5842-6 (2008)
Article DOI: 10.1016/j.bmcl.2008.06.084
BindingDB Entry DOI: 10.7270/Q2DN44V8
Sn1-specific diacylglycerol lipase alpha
(Homo sapiens (Human))
BDBM50247107
(CHEMBL460493 | N-methyl-2-(7-phenylheptanoyl)oxazo...)
Show SMILES CNC(=O)c1coc(n1)C(=O)CCCCCCc1ccccc1
Show InChI InChI=1S/C18H22N2O3/c1-19-17(22)15-13-23-18(20-15)16(21)12-8-3-2-5-9-14-10-6-4-7-11-14/h4,6-7,10-11,13H,2-3,5,8-9,12H2,1H3,(H,19,22)
NCI pathway
Reactome pathway
n/an/a<1.00E+4n/an/an/an/an/an/a
Leiden University
Curated by ChEMBL
Assay Description
Inhibition of full-length human DAGLalpha expressed in HEK293T cell membranes using para-nitrophenylbutyrate by colorimetric assay
J Med Chem 58: 9742-53 (2015)
Article DOI: 10.1021/acs.jmedchem.5b01627
BindingDB Entry DOI: 10.7270/Q2D50QZ9