null
SMILES: O=C(NCC(=O)N1CCCC1)Nc1ccc2cnccc2c1
InChI Key: InChIKey=DMIDPTCQPIJYFE-UHFFFAOYSA-N
PDB links: 1 PDB ID matches this monomer.
Activity Spreadsheet -- Enzyme Inhibition Constant Data from BindingDB
Found 5 hits for monomerid = 50247349
Trg + Lig
Ki
nM
ΔG°
kcal/mole
IC50
nM
Kd
nM
EC50/IC50
nM
koff
s-1
kon
M-1s-1
pHTemp
°C
Protein arginine N-methyltransferase 3
(Homo sapiens)
BDBM50247349
(CHEMBL4072005)
Show SMILES O=C(NCC(=O)N1CCCC1)Nc1ccc2cnccc2c1
Show InChI InChI=1S/C16H18N4O2/c21-15(20-7-1-2-8-20)11-18-16(22)19-14-4-3-13-10-17-6-5-12(13)9-14/h3-6,9-10H,1-2,7-8,11H2,(H2,18,19,22)
n/an/an/an/a 1.80E+3n/an/an/an/a
Icahn School of Medicine at Mount Sinai
Curated by ChEMBL
Assay Description
Binding affinity to beta galactosidase fused human PRMT3 (211 to 531 residues) expressed in human HEK293 cells after 6 hrs by InCELL hunter assay
J Med Chem 61: 1204-1217 (2018)
Article DOI: 10.1021/acs.jmedchem.7b01674
BindingDB Entry DOI: 10.7270/Q24J0HK6
3D
3D Structure (crystal)
Protein arginine N-methyltransferase 3
(Homo sapiens)
BDBM50247349
(CHEMBL4072005)
Show SMILES O=C(NCC(=O)N1CCCC1)Nc1ccc2cnccc2c1
Show InChI InChI=1S/C16H18N4O2/c21-15(20-7-1-2-8-20)11-18-16(22)19-14-4-3-13-10-17-6-5-12(13)9-14/h3-6,9-10H,1-2,7-8,11H2,(H2,18,19,22)
n/an/an/an/a 2.00E+3n/an/an/an/a
Icahn School of Medicine at Mount Sinai
Curated by ChEMBL
Assay Description
Binding affinity to beta galactosidase fused human PRMT3 (211 to 531 residues) expressed in human A549 cells after 6 hrs by InCELL hunter assay
J Med Chem 61: 1204-1217 (2018)
Article DOI: 10.1021/acs.jmedchem.7b01674
BindingDB Entry DOI: 10.7270/Q24J0HK6
3D
3D Structure (crystal)
Protein arginine N-methyltransferase 3
(Homo sapiens)
BDBM50247349
(CHEMBL4072005)
Show SMILES O=C(NCC(=O)N1CCCC1)Nc1ccc2cnccc2c1
Show InChI InChI=1S/C16H18N4O2/c21-15(20-7-1-2-8-20)11-18-16(22)19-14-4-3-13-10-17-6-5-12(13)9-14/h3-6,9-10H,1-2,7-8,11H2,(H2,18,19,22)
n/an/a 91n/an/an/an/an/an/a
Icahn School of Medicine at Mount Sinai
Curated by ChEMBL
Assay Description
Inhibition of FLAG-tagged wild type human PRMT3 expressed in HEK293 cells assessed as decrease in exogenous H4R3 dimethylation level using GFP-tagged...
J Med Chem 61: 1204-1217 (2018)
Article DOI: 10.1021/acs.jmedchem.7b01674
BindingDB Entry DOI: 10.7270/Q24J0HK6
3D
3D Structure (crystal)
Protein arginine N-methyltransferase 3
(Homo sapiens)
BDBM50247349
(CHEMBL4072005)
Show SMILES O=C(NCC(=O)N1CCCC1)Nc1ccc2cnccc2c1
Show InChI InChI=1S/C16H18N4O2/c21-15(20-7-1-2-8-20)11-18-16(22)19-14-4-3-13-10-17-6-5-12(13)9-14/h3-6,9-10H,1-2,7-8,11H2,(H2,18,19,22)
n/an/a 225n/an/an/an/an/an/a
Icahn School of Medicine at Mount Sinai
Curated by ChEMBL
Assay Description
Inhibition of FLAG-tagged wild type human PRMT3 expressed in HEK293 cells assessed as reduction in endogenous H4R3me2a level using GFP-tagged histone...
J Med Chem 61: 1204-1217 (2018)
Article DOI: 10.1021/acs.jmedchem.7b01674
BindingDB Entry DOI: 10.7270/Q24J0HK6
3D
3D Structure (crystal)
Protein arginine N-methyltransferase 3
(Homo sapiens)
BDBM50247349
(CHEMBL4072005)
Show SMILES O=C(NCC(=O)N1CCCC1)Nc1ccc2cnccc2c1
Show InChI InChI=1S/C16H18N4O2/c21-15(20-7-1-2-8-20)11-18-16(22)19-14-4-3-13-10-17-6-5-12(13)9-14/h3-6,9-10H,1-2,7-8,11H2,(H2,18,19,22)
n/an/a 19n/an/an/an/an/an/a
Icahn School of Medicine at Mount Sinai
Curated by ChEMBL
Assay Description
Inhibition of PRMT3 (unknown origin) using C-terminally biotinylated histone H4 as substrate in presence of [3H]S-adenosylmethionine by scintillation...
J Med Chem 61: 1204-1217 (2018)
Article DOI: 10.1021/acs.jmedchem.7b01674
BindingDB Entry DOI: 10.7270/Q24J0HK6
3D
3D Structure (crystal)