BDBM50247378 CHEMBL4065941
SMILES: CCN(CC)C(=O)CNC(=O)Nc1ccc2cnccc2c1
InChI Key: InChIKey=OJYSCIGDJZHZLI-UHFFFAOYSA-N
Data: 1 IC50
Activity Spreadsheet -- Enzyme Inhibition Constant Data from BindingDB
Found 1 hit for monomerid = 50247378
Trg + Lig
Ki
nM
ΔG°
kcal/mole
IC50
nM
Kd
nM
EC50/IC50
nM
koff
s-1
kon
M-1s-1
pHTemp
°C
Protein arginine N-methyltransferase 3
(Homo sapiens)
BDBM50247378
(CHEMBL4065941)
Show SMILES CCN(CC)C(=O)CNC(=O)Nc1ccc2cnccc2c1
Show InChI InChI=1S/C16H20N4O2/c1-3-20(4-2)15(21)11-18-16(22)19-14-6-5-13-10-17-8-7-12(13)9-14/h5-10H,3-4,11H2,1-2H3,(H2,18,19,22)
n/an/a 114n/an/an/an/an/an/a
Icahn School of Medicine at Mount Sinai
Curated by ChEMBL
Assay Description
Inhibition of PRMT3 (unknown origin) using C-terminally biotinylated histone H4 as substrate in presence of [3H]S-adenosylmethionine by scintillation...
J Med Chem 61: 1204-1217 (2018)
Article DOI: 10.1021/acs.jmedchem.7b01674
BindingDB Entry DOI: 10.7270/Q24J0HK6