BDBM50247425 CHEMBL4070699
SMILES: Nc1ccccc1C(=O)N\N=C\c1c(O)ccc2ccccc12
InChI Key: InChIKey=NFMZNLOLRGYQJB-RGVLZGJSSA-N
Data: 1 IC50
Activity Spreadsheet -- Enzyme Inhibition Constant Data from BindingDB
Found 1 hit for monomerid = 50247425
Trg + Lig
Ki
nM
ΔG°
kcal/mole
IC50
nM
Kd
nM
EC50/IC50
nM
koff
s-1
kon
M-1s-1
pHTemp
°C
Ribonucleoside-diphosphate reductase large subunit
(Homo sapiens (Human))
BDBM50247425
(CHEMBL4070699)
Show SMILES Nc1ccccc1C(=O)N\N=C\c1c(O)ccc2ccccc12
Show InChI InChI=1S/C18H15N3O2/c19-16-8-4-3-7-14(16)18(23)21-20-11-15-13-6-2-1-5-12(13)9-10-17(15)22/h1-11,22H,19H2,(H,21,23)/b20-11+
NCI pathway
Reactome pathway
n/an/a 2.38E+4n/an/an/an/an/an/a
Case Western Reserve University
Curated by ChEMBL
Assay Description
Inhibition of human RRM1 expressed in Escherichia coli BL21-codon plus(DE3)-RIL using [14C]-ADP as substrate after 3 mins by liquid scintillation cou...
J Med Chem 61: 666-680 (2018)
BindingDB Entry DOI: 10.7270/Q2W098CB