BDBM50247554 CHEMBL4083577
SMILES: ONC(=O)c1ccc(CNc2ccnc3ccccc23)cc1
InChI Key: InChIKey=DXLHCZWFVPWVRE-UHFFFAOYSA-N
Data: 1 IC50
Activity Spreadsheet -- Enzyme Inhibition Constant Data from BindingDB
Found 1 hit for monomerid = 50247554
Trg + Lig
Ki
nM
ΔG°
kcal/mole
IC50
nM
Kd
nM
EC50/IC50
nM
koff
s-1
kon
M-1s-1
pHTemp
°C
Cereblon/Histone deacetylase 6
(Homo sapiens (Human))
BDBM50247554
(CHEMBL4083577)
Show SMILES ONC(=O)c1ccc(CNc2ccnc3ccccc23)cc1
Show InChI InChI=1S/C17H15N3O2/c21-17(20-22)13-7-5-12(6-8-13)11-19-16-9-10-18-15-4-2-1-3-14(15)16/h1-10,22H,11H2,(H,18,19)(H,20,21)
NCI pathway
Reactome pathway
n/an/a 22n/an/an/an/an/an/a
Taipei Medical University
Curated by ChEMBL
Assay Description
Inhibition of full length recombinant human N-terminal GST-tagged HDAC6 expressed in baculovirus infected insect cells using RHK-K(Ac)-AMC as substra...
J Med Chem 61: 905-917 (2018)
BindingDB Entry DOI: 10.7270/Q2Q81GGB